program: Orca
programVersion: 5.0.2
elementType: O O O O N C C C C C C C C C C C C C C C C C C C H H H H H H H H H H H H H H H H H H H H H H H H H
charge: 0
multiplicity: 1
keywords: wb97x-d3
keywords: def2-TZVPP
keywords: def2/J RIJCOSX
keywords: DEFGRID2
keywords: scfconv7
keywords: smallprint printgap noloewdin
keywords: NOSOSCF
formula: C19H25NO4
InChI: InChI=1/C19H25NO4/c1-11(2)9-14-15(19(14,3)4)18(23)24-10-20-16(21)12-7-5-6-8-13(12)17(20)22/h9,14-15H,5-8,10H2,1-4H3
49 atoms
O  0.513565 1.652688 -1.229778
O  0.611477 1.403836 0.989192
O  -2.408789 2.171845 1.306528
O  -1.714662 -0.118738 -2.559597
N  -1.773261 1.279068 -0.729818
C  3.684699 1.129486 0.460086
C  3.100911 -0.243892 0.579461
C  2.471251 0.757768 -0.37755
C  3.554933 2.063772 1.637876
C  4.968237 1.338751 -0.307933
C  3.761623 -1.441393 0.027872
C  1.128521 1.290844 -0.094977
C  3.845055 -2.646651 0.601379
C  -0.784528 2.221912 -1.144455
C  4.561736 -3.770634 -0.085871
C  3.264231 -3.00822 1.933945
C  -3.352935 0.110162 0.470526
C  -3.152028 -0.565016 -0.661418
C  -4.306466 -0.276576 1.538609
C  -3.827859 -1.832932 -1.030449
C  -5.250375 -1.360161 1.01284
C  -4.506879 -2.424435 0.206282
C  -2.480346 1.311818 0.468616
C  -2.145861 0.165295 -1.471456
H  2.526853 -0.395768 1.48696
H  2.678016 0.602024 -1.430525
H  4.447648 1.983807 2.261842
H  2.698464 1.843938 2.270526
H  3.476864 3.1031 1.311306
H  5.027837 0.741165 -1.216525
H  5.831008 1.087437 0.312425
H  5.066876 2.385899 -0.600749
H  4.226161 -1.318836 -0.946232
H  -0.998672 2.573577 -2.151166
H  -0.806183 3.073027 -0.463767
H  5.380906 -4.149666 0.531295
H  4.978087 -3.469922 -1.047448
H  3.890836 -4.616607 -0.259266
H  2.554011 -3.833317 1.831976
H  2.747817 -2.189227 2.430723
H  4.047383 -3.361329 2.610154
H  -3.747395 -0.636088 2.408698
H  -4.866401 0.596351 1.883168
H  -4.560553 -1.637015 -1.820087
H  -3.108587 -2.537097 -1.455845
H  -5.775809 -1.823361 1.849275
H  -6.014792 -0.897525 0.38185
H  -5.195948 -3.213958 -0.097038
H  -3.750297 -2.895556 0.840491
elementType: O N C H
totalener: -1094.88023967 hartree
nucrepener: 2095.96907243 hartree
electener: -3190.84931211 hartree
oneelecener: -5654.61156565 hartree
twoeener: 2463.76225355 hartree
cpcmener: -0.03310710 hartree
kineticenergy: 1090.03363702 hartree
xcener: -105.970784455298 hartree
chargesum: -0.0000000
charge: -0.284176 -0.463888 -0.402791 -0.410140 -0.100630 0.099751 0.041037 -0.109467 -0.274745 -0.272179 -0.271035 0.416974 -0.050713 0.086164 -0.217436 -0.251280 -0.068850 -0.085364 -0.073926 -0.075985 -0.136912 -0.135053 0.321690 0.315786 0.095508 0.086843 0.094655 0.093490 0.097641 0.088667 0.097807 0.097213 0.115924 0.144290 0.131537 0.092653 0.087729 0.092989 0.095605 0.089162 0.095329 0.101705 0.093407 0.100377 0.093209 0.080709 0.077815 0.080473 0.078433
qa: -0.2842 -0.4639 -0.4028 -0.4101 -0.1006 0.0998 0.0410 -0.1095 -0.2747 -0.2722 -0.2710 0.4170 -0.0507 0.0862 -0.2174 -0.2513 -0.0689 -0.0854 -0.0739 -0.0760 -0.1369 -0.1351 0.3217 0.3158 0.0955 0.0868 0.0947 0.0935 0.0976 0.0887 0.0978 0.0972 0.1159 0.1443 0.1315 0.0927 0.0877 0.0930 0.0956 0.0892 0.0953 0.1017 0.0934 0.1004 0.0932 0.0807 0.0778 0.0805 0.0784
va: 2.1157 2.0481 2.1140 2.1076 3.0758 3.6922 3.7776 3.8233 3.9032 3.9147 3.8811 4.1617 3.7694 3.8852 3.9200 3.9403 3.6514 3.6873 3.9194 3.9224 3.9145 3.9139 4.2158 4.2190 1.0289 1.0367 0.9999 1.0203 0.9998 1.0070 1.0015 1.0016 1.0120 0.9936 1.0173 0.9963 1.0091 0.9964 0.9967 1.0113 0.9972 1.0047 1.0160 1.0047 1.0156 1.0093 1.0066 1.0094 1.0068
dispcorr: -0.022454592 hartree
energy: -1094.902694265163
dipole: 19.23472 -19.57335 -0.33862 -17.32325 16.14508 -1.17817 8.65291 -8.80784 -0.15492
magnitude: 1.23562 au
magnitude: 3.14069 debye
