program: Gaussian 09
title: 000071321
version: EM64L-G09RevD.01
frameworkgroup: C1[X(C15H16ClNO4)]
method: RPBEPBE
basis: SDD
operation: Freq
keyword: #p
keyword: freq=noraman
keyword: PBEPBE/SDD
title: #p freq=noraman PBEPBE/SDD
converged: YES YES NO NO
title: Mulliken charges:
elementType: Cl O O O O N C C C C C C C C C C C C C C C H H H H H H H H H H H H H H H H
charge: -0.052244 -0.273044 -0.263665 -0.440604 -0.182893 -0.093377 0.276638 -0.401148 0.288302 -0.723287 -0.699637 0.055657 0.119476 0.062887 0.326238 -0.771132 -0.349434 -0.362121 -0.207209 -0.207629 -0.107458 0.208146 0.212222 0.256369 0.225254 0.238799 0.245466 0.252393 0.207541 0.242645 0.255142 0.221628 0.263170 0.275926 0.385843 0.256643 0.258499
chargesum: 0.00000
title: Mulliken charges with hydrogens summed into heavy atoms:
elementType: Cl O O O O N C C C C C C C C C C C C C C C
charge: -0.052244 -0.273044 -0.263665 -0.054761 -0.182893 -0.093377 0.276638 0.019220 0.288302 -0.002865 0.005762 0.055657 0.119476 0.062887 0.326238 -0.051717 -0.086264 -0.086196 0.049433 0.050870 -0.107458
polarizability: 3.11532647e+02 2.98672587e+01 1.92050927e+02 -1.70107580e+01 1.74260342e+01 1.25279328e+02
1716.lowfreq: -9.9811 -1.5414 -0.0018 -0.0016 -0.0011 4.9001 9.5398 13.2433 30.8964
frequency: -2.8800 11.9512 30.8654 39.5866 54.5389 62.1535 76.4685 101.5623 105.3308 139.9132 166.2446 183.3671 204.3563 218.2132 246.3445 251.3583 261.2551 268.0161 295.9614 304.4576 326.7633 346.9085 357.1262 387.6662 402.3714 409.1263 472.4444 496.1596 507.6733 520.3896 564.4618 583.6319 621.8475 638.8921 659.8839 688.1385 691.1224 721.6046 723.5296 728.3641 789.6559 816.3943 833.7032 844.2326 887.7629 917.9318 921.9794 931.8944 965.9538 967.6772 974.5729 981.5118 992.7470 997.3667 1016.0007 1019.8600 1046.9106 1071.6068 1101.8710 1111.3682 1163.3019 1166.6649 1180.7569 1191.9615 1203.4444 1222.8410 1274.9849 1288.7834 1294.5881 1321.7217 1367.0875 1370.6437 1374.8249 1393.1452 1403.1063 1407.4277 1454.5141 1455.2764 1456.8739 1463.3546 1467.5948 1471.5902 1480.2863 1485.7984 1540.0351 1579.4840 1609.2451 1622.3410 1683.6328 2967.4946 2993.0156 2993.3928 2997.7892 3021.5950 3076.1529 3089.6424 3094.0168 3102.1072 3107.4768 3114.7134 3157.7477 3157.9280 3175.6123 3179.3439 3522.5539
redmass: 4.3016 6.3922 4.9443 7.1659 4.9988 5.9115 5.9559 3.7947 1.0361 7.0635 5.1501 1.2932 5.6371 2.6251 3.6027 1.7433 4.2272 1.6201 3.4952 4.4285 2.9400 4.1543 4.9333 3.6878 5.3093 2.9349 7.6524 3.8023 4.2212 4.2806 3.5990 1.1896 6.7882 5.1981 5.4391 6.2739 5.0391 5.1810 5.4158 3.9768 3.6820 4.2577 1.2807 1.5251 8.3988 1.6232 2.3992 2.5113 3.1400 1.4112 2.2140 1.3602 5.5618 1.3164 3.3710 4.5797 1.5026 2.6611 2.1094 1.5359 3.6606 2.4246 1.2244 2.5304 1.8801 1.5464 2.8321 2.4847 1.2860 2.3846 2.2694 1.3676 2.3084 1.2146 3.6901 1.3978 2.3418 1.1016 1.0646 1.0600 1.0681 1.0772 1.0512 1.0631 7.6892 7.9607 6.3350 8.0261 9.7006 1.0552 1.0369 1.0357 1.0359 1.1049 1.0982 1.1002 1.0990 1.0992 1.1000 1.1003 1.0886 1.0888 1.0969 1.0980 1.0642
irintensity: 1.4630 0.0645 0.2747 0.0461 0.1323 0.6653 0.6501 4.2053 0.0944 0.7267 1.9020 0.2579 2.8632 2.9642 1.7050 1.2095 1.6309 0.0686 1.0710 0.7693 2.8312 2.3262 8.3714 2.6737 0.5272 0.0039 16.0079 10.4633 8.2108 11.2755 28.6559 126.9324 0.2102 9.9465 7.9926 6.9391 7.0311 29.2664 12.6469 11.5574 17.9369 16.1746 7.4219 58.7626 10.4333 0.1523 5.7161 3.2925 51.5859 4.7008 45.6822 0.4208 69.4238 2.1261 453.1334 36.5239 5.5996 50.9441 14.6806 2.8034 30.0192 77.3346 0.5074 7.9029 16.6152 0.0965 10.0804 16.2182 2.2635 6.3803 13.5087 29.7422 22.6739 26.2888 17.3335 35.8519 106.6999 14.2747 12.1196 3.1307 5.0603 12.9488 28.0712 23.9144 2.8268 4.4160 28.3473 22.1117 200.2028 34.2752 22.3235 16.1982 18.2467 27.2131 11.5196 10.3659 38.3558 18.9068 9.9193 23.8576 0.1658 2.4039 4.1597 1.4427 28.2677
temp: 298.150 k
press: 1.00000 atm
elementType: 17 8 8 8 8 7 6 6 6 6 6 6 6 6 6 6 6 6 6 6 6 1 1 1 1 1 1 1 1 1 1 1 1 1 1 1 1
symmnumber: 1
zpe: 736941.2 jmol-1
zpe.correction: 0.280686 hartree
zpe.thermalcorrener: 0.301156 hartree
zpe.thermalcorrenthalpy: 0.302101 hartree
zpe.thermalcorrgfe: 0.228913 hartree
zpe.sumelectzpe: -1395.341743 hartree
zpe.sumelectthermal: -1395.321273 hartree
zpe.sumelectthermalent: -1395.320329 hartree
zpe.sumelectthermalfe: -1395.393516 hartree
dipole: 4.1142 -0.0764 -3.1751
dipole: 5.1974
quadrupole: -121.9043 -120.1165 -132.4231
quadrupole: -5.4298 -7.5085 -0.0407
quadrupole: 2.9103 4.6982 -7.6085 -5.4298 -7.5085 -0.0407
hfenergy: -1395.6224293 hartree
pointgroup: C01 [X(C15H16Cl1N1O4)]
dipole: -1.5586488 -0.5177477 1.2181533 debye
polarizability: 307.0309669|-21.1516484|194.4337767|-38.3070144|15.3099979|127.3981578 unknown
InChI: InChI=1S/C15H16ClNO4/c1-9-12(8-20-15(2,3)14(18)19)21-13(17-9)10-4-6-11(16)7-5-10/h4-7,18H,8H2,1-3H3
charge 0 multiplicity 1
37 atoms
Cl 6.806133 -1.661874 -1.304633
O  -2.753108 -0.042784 0.008423
O  0.362367 -0.108553 0.603458
O  -5.685033 -1.683048 -1.383277
O  -4.259018 -0.057202 -2.226722
N  1.152595 2.035549 0.501585
C  -3.91906 -0.950887 0.096139
C  -2.015391 0.167042 1.277129
C  -0.698266 0.770749 0.953199
C  -4.933402 -0.502977 1.180949
C  -3.467083 -2.419606 0.302566
C  -0.209129 2.068682 0.885857
C  -4.581316 -0.808198 -1.291371
C  1.45978 0.746512 0.339574
C  2.730716 0.14947 -0.054531
C  -0.914523 3.366389 1.135557
C  2.87615 -1.257588 -0.193289
C  3.84508 0.99667 -0.305746
C  4.114625 -1.81277 -0.573899
C  5.085586 0.450374 -0.686931
C  5.202038 -0.949234 -0.814216
H  -1.865337 -0.792865 1.810428
H  -2.581928 0.855138 1.935249
H  -5.849764 -1.112095 1.115075
H  -4.504849 -0.633932 2.190548
H  -5.203876 0.558885 1.044922
H  -2.707599 -2.691623 -0.44995
H  -4.327233 -3.101869 0.206457
H  -3.030091 -2.55483 1.308054
H  -0.403018 3.944008 1.926062
H  -0.910095 3.985251 0.220695
H  -1.963713 3.20651 1.434147
H  2.019209 -1.91145 -0.00631
H  3.721861 2.078764 -0.19923
H  -6.104915 -1.575434 -2.27909
H  4.232395 -2.894522 -0.683082
H  5.945214 1.09745 -0.881995
