program: Orca
programVersion: 5.0.2
elementType: O O O O N C C C C C C C C C C C C C C C C C C C H H H H H H H H H H H H H H H H H H H H H H H H H
charge: 0
multiplicity: 1
keywords: wb97x-d3
keywords: def2-TZVPP
keywords: def2/J RIJCOSX
keywords: DEFGRID2
keywords: scfconv7
keywords: smallprint printgap noloewdin
keywords: NOSOSCF
formula: C19H25NO4
InChI: InChI=1/C19H25NO4/c1-11(2)9-14-15(19(14,3)4)18(23)24-10-20-16(21)12-7-5-6-8-13(12)17(20)22/h9,14-15H,5-8,10H2,1-4H3
49 atoms
O  -0.535738 1.718307 1.492782
O  -0.286053 -0.501286 1.332832
O  1.459085 2.674876 -0.626203
O  2.61431 -0.310149 2.612533
N  1.797437 1.373885 1.251823
C  -2.240923 0.170802 -1.091511
C  -2.880813 -0.712455 -0.056267
C  -2.203269 0.560027 0.375647
C  -0.986213 -0.308266 -1.780661
C  -3.114004 1.017924 -1.983513
C  -4.347405 -0.843886 0.076518
C  -0.926758 0.492231 1.1175
C  -5.054023 -1.966896 -0.065462
C  0.745642 1.870073 2.079602
C  -6.54201 -1.973146 0.120028
C  -4.461198 -3.298717 -0.412127
C  2.940296 0.763216 -0.649522
C  3.260112 -0.124456 0.290901
C  3.438302 0.741928 -2.047467
C  4.1883 -1.267262 0.106553
C  4.066074 -0.622074 -2.342082
C  4.966897 -1.09249 -1.198999
C  1.986151 1.748015 -0.074964
C  2.544336 0.227653 1.545556
H  -2.309239 -1.604402 0.177564
H  -2.83521 1.401455 0.640302
H  -0.388626 -0.973761 -1.160834
H  -1.250509 -0.853286 -2.688824
H  -0.358989 0.536857 -2.074407
H  -2.555766 1.877211 -2.358171
H  -3.455512 0.438497 -2.843042
H  -3.9992 1.395373 -1.473853
H  -4.891927 0.063739 0.321269
H  0.812627 1.357299 3.040305
H  0.847526 2.942415 2.229862
H  -7.050255 -2.306967 -0.788208
H  -6.835659 -2.666146 0.912562
H  -6.928899 -0.988139 0.378079
H  -4.641959 -4.024858 0.384103
H  -4.931419 -3.703476 -1.311662
H  -3.389671 -3.263638 -0.593413
H  2.62331 0.95864 -2.741964
H  4.168862 1.545066 -2.188622
H  4.86267 -1.350158 0.961737
H  3.611024 -2.197321 0.095022
H  3.269996 -1.355512 -2.500342
H  4.633631 -0.575115 -3.27265
H  5.765802 -0.361015 -1.046371
H  5.454341 -2.030938 -1.46705
totalener: -1094.85165077 hartree
nucrepener: 2147.23770184 hartree
electener: -3242.08935262 hartree
oneelecener: -5756.49476826 hartree
twoeener: 2514.40541564 hartree
kineticenergy: 1090.10359519 hartree
xcener: -105.974431812414 hartree
chargesum: 0.0000000
charge: -0.254717 -0.376631 -0.313714 -0.307569 -0.124627 0.131494 0.027791 -0.101191 -0.289786 -0.243000 -0.200080 0.323008 -0.034836 0.091228 -0.208888 -0.238438 -0.117531 -0.026258 -0.083121 -0.070379 -0.130005 -0.139773 0.230795 0.251052 0.092901 0.072933 0.092545 0.092283 0.088118 0.099294 0.088782 0.071680 0.076675 0.127942 0.118755 0.083678 0.085363 0.077081 0.089737 0.082396 0.082334 0.090932 0.094058 0.092992 0.096069 0.076099 0.078535 0.074448 0.079543
qa: -0.2547 -0.3766 -0.3137 -0.3076 -0.1246 0.1315 0.0278 -0.1012 -0.2898 -0.2430 -0.2001 0.3230 -0.0348 0.0912 -0.2089 -0.2384 -0.1175 -0.0263 -0.0831 -0.0704 -0.1300 -0.1398 0.2308 0.2511 0.0929 0.0729 0.0925 0.0923 0.0881 0.0993 0.0888 0.0717 0.0767 0.1279 0.1188 0.0837 0.0854 0.0771 0.0897 0.0824 0.0823 0.0909 0.0941 0.0930 0.0961 0.0761 0.0785 0.0744 0.0795
va: 2.1324 2.1265 2.1946 2.2065 3.0731 3.7320 3.7878 3.8933 3.9083 3.9056 3.9033 4.2728 3.7931 3.9183 3.9386 3.9489 3.6490 3.5796 3.9265 3.9097 3.8947 3.9015 4.2611 4.2692 1.0325 1.0381 1.0173 1.0047 1.0085 1.0035 1.0050 1.0101 1.0186 1.0131 0.9934 0.9985 0.9977 1.0122 0.9990 0.9998 1.0134 1.0183 1.0083 1.0193 1.0084 1.0094 1.0115 1.0080 1.0115
dispcorr: -0.025114579 hartree
energy: -1094.876765353635
dipole: -18.61830 18.78973 0.17142 -15.07511 14.79126 -0.28385 -18.30941 17.28492 -1.02449
magnitude: 1.07682 au
magnitude: 2.73705 debye
