program: Orca
programVersion: 5.0.2
elementType: O O O O N C C C C C C C C C C C C C C C C C C C H H H H H H H H H H H H H H H H H H H H H H H H H
charge: 0
multiplicity: 1
keywords: wb97x-d3
keywords: def2-TZVPP
keywords: def2/J RIJCOSX
keywords: DEFGRID2
keywords: scfconv7
keywords: smallprint printgap noloewdin
keywords: NOSOSCF
formula: C19H25NO4
InChI: InChI=1/C19H25NO4/c1-11(2)9-14-15(19(14,3)4)18(23)24-10-20-16(21)12-7-5-6-8-13(12)17(20)22/h9,14-15H,5-8,10H2,1-4H3
49 atoms
O  -0.365134 1.126721 -0.057243
O  -1.516116 0.815976 1.842848
O  2.890933 2.661578 -1.119218
O  1.538085 -0.771091 1.528756
N  1.915168 1.159787 0.335136
C  -2.608158 -1.649677 0.232711
C  -3.63842 -0.570878 0.305995
C  -2.236448 -0.232669 -0.179631
C  -2.074254 -2.235829 1.517645
C  -2.649729 -2.656651 -0.891091
C  -4.787865 -0.483225 -0.620505
C  -1.368579 0.602909 0.664974
C  -5.788505 0.399109 -0.53358
C  0.680049 1.8180 0.612183
C  -6.929335 0.371995 -1.504858
C  -5.880218 1.471085 0.509714
C  3.942751 0.550613 -0.567551
C  3.543978 -0.461658 0.203962
C  5.223115 0.598345 -1.315588
C  4.294966 -1.722399 0.416084
C  6.150116 -0.506214 -0.804512
C  5.409804 -1.830561 -0.625566
C  2.901499 1.60935 -0.53465
C  2.229727 -0.11082 0.795753
H  -3.832999 -0.219506 1.314111
H  -2.110693 -0.087116 -1.246605
H  -2.641601 -3.133642 1.771999
H  -1.028071 -2.530303 1.409937
H  -2.147016 -1.557726 2.364732
H  -1.670982 -3.124263 -1.014352
H  -3.36791 -3.449705 -0.671681
H  -2.919993 -2.216943 -1.850658
H  -4.821406 -1.205212 -1.430697
H  0.505866 1.85769 1.685562
H  0.731046 2.833284 0.223678
H  -6.986337 1.305995 -2.070444
H  -6.847778 -0.448653 -2.217725
H  -7.885599 0.270042 -0.984188
H  -6.128944 2.429996 0.048974
H  -6.682252 1.256346 1.221082
H  -4.961312 1.609791 1.076237
H  5.024099 0.474049 -2.384947
H  5.689376 1.580805 -1.209516
H  4.707497 -1.732322 1.430233
H  3.620346 -2.580217 0.358752
H  6.984648 -0.632221 -1.495665
H  6.580727 -0.200031 0.153161
H  6.108496 -2.615854 -0.333744
H  4.978669 -2.135373 -1.583396
elementType: O N C H
totalener: -1094.87873719 hartree
nucrepener: 2070.03162529 hartree
electener: -3164.91036248 hartree
oneelecener: -5602.48949772 hartree
twoeener: 2437.57913524 hartree
cpcmener: -0.03035241 hartree
kineticenergy: 1090.04380898 hartree
xcener: -105.972428474995 hartree
chargesum: 0.0000000
charge: -0.285896 -0.459031 -0.409349 -0.415083 -0.093127 0.129791 -0.037866 -0.053098 -0.274786 -0.294478 -0.259268 0.383783 -0.019043 0.079943 -0.230517 -0.261616 -0.082299 -0.058618 -0.072326 -0.070995 -0.135402 -0.135894 0.323221 0.314761 0.101226 0.092825 0.097667 0.092500 0.096062 0.098868 0.103581 0.088394 0.118700 0.142248 0.123599 0.094179 0.087626 0.093141 0.092968 0.100650 0.086812 0.100751 0.092853 0.100268 0.093544 0.081411 0.078118 0.080889 0.078315
qa: -0.2859 -0.4590 -0.4093 -0.4151 -0.0931 0.1298 -0.0379 -0.0531 -0.2748 -0.2945 -0.2593 0.3838 -0.0190 0.0799 -0.2305 -0.2616 -0.0823 -0.0586 -0.0723 -0.0710 -0.1354 -0.1359 0.3232 0.3148 0.1012 0.0928 0.0977 0.0925 0.0961 0.0989 0.1036 0.0884 0.1187 0.1422 0.1236 0.0942 0.0876 0.0931 0.0930 0.1006 0.0868 0.1008 0.0929 0.1003 0.0935 0.0814 0.0781 0.0809 0.0783
va: 2.1064 2.0478 2.1105 2.0985 3.0915 3.7542 3.8321 3.7884 3.8850 3.9175 3.9014 4.1788 3.7201 3.8553 3.9312 3.9446 3.6978 3.6606 3.9196 3.9186 3.9116 3.9139 4.2249 4.2158 1.0206 1.0323 1.0016 1.0071 1.0170 1.0016 0.9989 1.0035 1.0085 1.0161 1.0163 0.9962 1.0084 0.9948 0.9984 0.9958 1.0128 1.0053 1.0158 1.0053 1.0156 1.0095 1.0070 1.0095 1.0068
dispcorr: -0.022649637 hartree
energy: -1094.901386828690
dipole: -18.24672 19.48493 1.23821 -13.49727 12.50990 -0.98737 -5.52527 4.40308 -1.12219
magnitude: 1.94097 au
magnitude: 4.93355 debye
