program: Orca
programVersion: 5.0.2
elementType: O O O O N C C C C C C C C C C C C C C C C C C C H H H H H H H H H H H H H H H H H H H H H H H H H
charge: 0
multiplicity: 1
keywords: wb97x-d3
keywords: def2-TZVPP
keywords: def2/J RIJCOSX
keywords: DEFGRID2
keywords: scfconv7
keywords: smallprint printgap noloewdin
keywords: NOSOSCF
formula: C19H25NO4
InChI: InChI=1/C19H25NO4/c1-11(2)9-14-15(19(14,3)4)18(23)24-10-20-16(21)12-7-5-6-8-13(12)17(20)22/h9,14-15H,5-8,10H2,1-4H3
49 atoms
O  -0.381618 0.840589 -0.588993
O  -1.794605 1.919659 0.774195
O  2.868818 1.352409 -2.24649
O  1.458204 0.418935 1.967595
N  1.868398 1.1415 -0.178633
C  -2.81424 -1.048752 1.174838
C  -3.794314 -0.24511 0.391039
C  -2.342267 -0.261457 -0.042843
C  -2.435135 -0.59528 2.563223
C  -2.792865 -2.54959 1.015823
C  -4.838482 -0.867974 -0.462916
C  -1.517683 0.947742 0.114562
C  -5.411348 -0.277588 -1.514917
C  0.636459 1.817646 -0.408496
C  -6.490487 -0.956487 -2.300815
C  -5.042217 1.094536 -1.986993
C  3.907423 0.10965 -0.447646
C  3.493036 -0.17315 0.788321
C  5.200229 -0.321194 -1.033483
C  4.240362 -0.992465 1.773084
C  6.121804 -0.815824 0.082451
C  5.386164 -1.722561 1.068175
C  2.869203 0.930881 -1.119246
C  2.168402 0.46322 0.995748
H  -4.087762 0.687503 0.866704
H  -2.096609 -0.866902 -0.908161
H  -2.545769 0.477144 2.7088
H  -3.074807 -1.08913 3.297728
H  -1.401778 -0.862124 2.795864
H  -1.813617 -2.947975 1.288145
H  -3.53083 -3.016916 1.671543
H  -3.003998 -2.869996 -0.004506
H  -5.176198 -1.862014 -0.183221
H  0.41017 2.475145 0.428523
H  0.724883 2.415516 -1.314058
H  -7.402018 -0.353073 -2.321199
H  -6.189179 -1.093524 -3.342929
H  -6.743812 -1.93501 -1.892739
H  -4.858136 1.09905 -3.063787
H  -5.86306 1.795563 -1.814151
H  -4.157678 1.496001 -1.495474
H  5.020373 -1.112478 -1.768535
H  5.66055 0.501977 -1.585307
H  4.623053 -0.342191 2.566534
H  3.569201 -1.700891 2.264897
H  6.971409 -1.345015 -0.351414
H  6.530107 0.045764 0.618767
H  6.082973 -2.111696 1.811937
H  4.986423 -2.588091 0.532075
elementType: O N C H
totalener: -1094.87849530 hartree
nucrepener: 2074.02006810 hartree
electener: -3168.89856340 hartree
oneelecener: -5610.33826368 hartree
twoeener: 2441.43970028 hartree
cpcmener: -0.02946615 hartree
kineticenergy: 1090.04387562 hartree
xcener: -105.971139856951 hartree
chargesum: 0.0000000
charge: -0.280915 -0.459513 -0.408996 -0.414870 -0.094650 0.154459 -0.032201 -0.098791 -0.274494 -0.291815 -0.282590 0.387219 -0.014606 0.077827 -0.225709 -0.246118 -0.084719 -0.054895 -0.075236 -0.069408 -0.133015 -0.137834 0.325129 0.311663 0.103569 0.094304 0.094281 0.096897 0.094787 0.098411 0.099822 0.092486 0.122000 0.140099 0.125104 0.094086 0.094887 0.088338 0.093427 0.102653 0.081497 0.101621 0.093352 0.100480 0.094241 0.080151 0.078072 0.080684 0.078828
qa: -0.2809 -0.4595 -0.4090 -0.4149 -0.0946 0.1545 -0.0322 -0.0988 -0.2745 -0.2918 -0.2826 0.3872 -0.0146 0.0778 -0.2257 -0.2461 -0.0847 -0.0549 -0.0752 -0.0694 -0.1330 -0.1378 0.3251 0.3117 0.1036 0.0943 0.0943 0.0969 0.0948 0.0984 0.0998 0.0925 0.1220 0.1401 0.1251 0.0941 0.0949 0.0883 0.0934 0.1027 0.0815 0.1016 0.0934 0.1005 0.0942 0.0802 0.0781 0.0807 0.0788
va: 2.1035 2.0465 2.1095 2.0965 3.0949 3.7161 3.8322 3.8078 3.8841 3.9116 3.8830 4.1556 3.7096 3.8592 3.9283 3.9432 3.6998 3.6634 3.9209 3.9183 3.9119 3.9160 4.2223 4.2145 1.0254 1.0314 1.0170 1.0020 1.0054 1.0028 0.9991 1.0011 1.0031 1.0161 1.0131 0.9955 0.9967 1.0068 0.9998 0.9979 1.0137 1.0050 1.0158 1.0052 1.0153 1.0100 1.0067 1.0096 1.0065
dispcorr: -0.022999133 hartree
energy: -1094.901494431293
dipole: -16.36156 17.77046 1.40889 -14.63853 13.13079 -1.50775 0.42615 -0.63807 -0.21192
magnitude: 2.07441 au
magnitude: 5.27273 debye
