program: Orca
programVersion: 5.0.2
elementType: O O O O N C C C C C C C C C C C C C C C C C C C H H H H H H H H H H H H H H H H H H H H H H H H H
charge: 0
multiplicity: 1
keywords: wb97x-d3
keywords: def2-TZVPP
keywords: def2/J RIJCOSX
keywords: DEFGRID2
keywords: scfconv7
keywords: smallprint printgap noloewdin
keywords: NOSOSCF
formula: C19H25NO4
InChI: InChI=1/C19H25NO4/c1-11(2)9-14-15(19(14,3)4)18(23)24-10-20-16(21)12-7-5-6-8-13(12)17(20)22/h9,14-15H,5-8,10H2,1-4H3
49 atoms
O  -0.283944 -0.633886 -0.542941
O  -1.682826 -0.16924 -2.22655
O  1.851596 1.778034 -1.317444
O  2.69339 -2.435717 0.152119
N  1.994377 -0.467255 -0.825504
C  -3.067684 1.463969 0.114027
C  -3.874125 0.270283 -0.269759
C  -2.401145 0.095755 0.042378
C  -2.766404 2.511727 -0.92953
C  -3.207866 2.036202 1.503983
C  -4.909161 -0.320073 0.617541
C  -1.460371 -0.235913 -1.041349
C  -5.334519 -1.584481 0.55166
C  0.789278 -0.896325 -1.443626
C  -6.422118 -2.090189 1.449504
C  -4.784998 -2.587368 -0.415377
C  3.639732 0.884912 0.052017
C  3.88838 -0.354533 0.477701
C  4.456452 2.079895 0.375841
C  5.040008 -0.75041 1.32444
C  5.40565 1.750153 1.529504
C  6.066742 0.383561 1.35188
C  2.411035 0.858675 -0.778334
C  2.828736 -1.255698 -0.041515
H  -4.094888 0.206531 -1.332491
H  -2.15165 -0.339353 1.00375
H  -2.76527 2.119396 -1.9444
H  -3.523505 3.297536 -0.888457
H  -1.797091 2.981097 -0.748367
H  -2.309884 2.592679 1.779628
H  -4.050516 2.729372 1.552705
H  -3.363037 1.269926 2.263516
H  -5.371549 0.342114 1.34417
H  0.654074 -0.368215 -2.385709
H  0.844694 -1.965768 -1.643075
H  -6.801386 -1.314457 2.114814
H  -7.263969 -2.475384 0.867754
H  -6.069102 -2.921018 2.066306
H  -4.488169 -3.50298 0.102535
H  -5.547777 -2.881414 -1.141988
H  -3.921704 -2.223892 -0.971064
H  5.016886 2.387088 -0.513181
H  3.81021 2.92382 0.629168
H  4.684427 -0.977755 2.334788
H  5.487937 -1.673783 0.949257
H  6.16761 2.526866 1.608285
H  4.847449 1.763255 2.470052
H  6.784104 0.207385 2.154591
H  6.634859 0.376267 0.417233
elementType: O N C H
totalener: -1094.87923907 hartree
nucrepener: 2060.95995961 hartree
electener: -3155.83919868 hartree
oneelecener: -5584.09366226 hartree
twoeener: 2428.25446358 hartree
cpcmener: -0.02952349 hartree
kineticenergy: 1090.03550443 hartree
xcener: -105.968806662320 hartree
chargesum: -0.0000000
charge: -0.276623 -0.465499 -0.412046 -0.408491 -0.103269 0.149711 -0.035010 -0.092089 -0.272841 -0.293076 -0.281269 0.391743 -0.014423 0.082979 -0.226386 -0.245913 -0.056887 -0.080534 -0.071492 -0.075666 -0.136002 -0.134589 0.313765 0.322825 0.101492 0.094137 0.092569 0.096072 0.099173 0.098360 0.100163 0.092285 0.122803 0.130777 0.131269 0.088788 0.094083 0.094777 0.094090 0.101602 0.081342 0.100787 0.094016 0.101494 0.093661 0.080702 0.078030 0.080745 0.077866
qa: -0.2766 -0.4655 -0.4120 -0.4085 -0.1033 0.1497 -0.0350 -0.0921 -0.2728 -0.2931 -0.2813 0.3917 -0.0144 0.0830 -0.2264 -0.2459 -0.0569 -0.0805 -0.0715 -0.0757 -0.1360 -0.1346 0.3138 0.3228 0.1015 0.0941 0.0926 0.0961 0.0992 0.0984 0.1002 0.0923 0.1228 0.1308 0.1313 0.0888 0.0941 0.0948 0.0941 0.1016 0.0813 0.1008 0.0940 0.1015 0.0937 0.0807 0.0780 0.0807 0.0779
va: 2.1081 2.0378 2.0990 2.1087 3.1085 3.7233 3.8306 3.8123 3.8859 3.9130 3.8835 4.1459 3.7082 3.8697 3.9284 3.9420 3.6657 3.6935 3.9199 3.9213 3.9156 3.9135 4.2133 4.2210 1.0267 1.0308 1.0172 1.0013 1.0016 1.0030 0.9989 1.0010 1.0030 1.0166 1.0055 1.0068 0.9958 0.9967 0.9995 0.9982 1.0150 1.0048 1.0153 1.0052 1.0153 1.0095 1.0068 1.0097 1.0068
dispcorr: -0.022531340 hartree
energy: -1094.901770411673
dipole: -17.81331 19.13672 1.32341 4.57433 -4.14685 0.42748 11.89197 -10.29202 1.59994
magnitude: 2.11990 au
magnitude: 5.38836 debye
