program: Orca
programVersion: 5.0.2
elementType: O O O O N C C C C C C C C C C C C C C C C C C C H H H H H H H H H H H H H H H H H H H H H H H H H
charge: 0
multiplicity: 1
keywords: wb97x-d3
keywords: def2-TZVPP
keywords: def2/J RIJCOSX
keywords: DEFGRID2
keywords: scfconv7
keywords: smallprint printgap noloewdin
keywords: NOSOSCF
formula: C19H25NO4
InChI: InChI=1/C19H25NO4/c1-11(2)9-14-15(19(14,3)4)18(23)24-10-20-16(21)12-7-5-6-8-13(12)17(20)22/h9,14-15H,5-8,10H2,1-4H3
49 atoms
O  -0.287852 1.255658 0.576278
O  -1.531998 1.957744 -1.150371
O  1.670082 0.071999 -1.729162
O  2.839356 1.818348 2.296412
N  1.996057 1.239065 0.227838
C  -3.805167 0.726943 0.676065
C  -3.544561 -0.128078 -0.52724
C  -2.383465 0.2987 0.347891
C  -4.237386 2.157074 0.463697
C  -4.410888 0.105707 1.910868
C  -3.907603 -1.557622 -0.597184
C  -1.392481 1.253071 -0.181073
C  -4.545155 -2.137961 -1.618339
C  0.82664 2.048509 0.180169
C  -4.828457 -3.60919 -1.620098
C  -4.995416 -1.389493 -2.843513
C  3.511842 -0.431001 -0.237743
C  3.849161 0.07896 0.947887
C  4.241212 -1.51571 -0.939301
C  4.999224 -0.366387 1.771871
C  5.616707 -1.697089 -0.295703
C  5.532073 -1.694849 1.230338
C  2.300026 0.27205 -0.723063
C  2.878284 1.146862 1.298189
H  -3.601802 0.408404 -1.468508
H  -1.973372 -0.4552 1.011067
H  -3.905044 2.57064 -0.486369
H  -5.327794 2.216149 0.47866
H  -3.865074 2.802958 1.262047
H  -4.033187 -0.895973 2.112684
H  -4.201006 0.717971 2.790104
H  -5.496005 0.036609 1.808742
H  -3.610878 -2.178074 0.243338
H  0.936541 2.875697 0.879313
H  0.694226 2.448677 -0.82297
H  -5.903086 -3.803652 -1.673783
H  -4.385807 -4.091569 -2.496292
H  -4.439983 -4.106858 -0.731361
H  -5.384968 -0.398014 -2.615661
H  -4.175972 -1.259877 -3.554639
H  -5.781024 -1.933697 -3.368325
H  3.659127 -2.440856 -0.87712
H  4.332317 -1.288689 -2.004148
H  5.777992 0.403013 1.749457
H  4.702807 -0.462069 2.819279
H  6.064637 -2.628426 -0.645375
H  6.277374 -0.889468 -0.624534
H  6.513968 -1.89662 1.661205
H  4.874851 -2.506176 1.557064
elementType: O N C H
totalener: -1094.87938326 hartree
nucrepener: 2049.32261939 hartree
electener: -3144.20200265 hartree
oneelecener: -5560.93596167 hartree
twoeener: 2416.73395902 hartree
cpcmener: -0.03114479 hartree
kineticenergy: 1090.03862712 hartree
xcener: -105.970109765246 hartree
chargesum: 0.0000000
charge: -0.280082 -0.460254 -0.408762 -0.408881 -0.105397 0.105089 0.056512 -0.133934 -0.276477 -0.267403 -0.303924 0.417494 -0.011278 0.082538 -0.220475 -0.285019 -0.057758 -0.079950 -0.075627 -0.071608 -0.134235 -0.136253 0.315619 0.319572 0.091613 0.091762 0.092692 0.095572 0.098944 0.087870 0.097389 0.097452 0.116388 0.127251 0.137950 0.093025 0.097648 0.085235 0.099862 0.107917 0.094186 0.101320 0.093504 0.100518 0.093982 0.081052 0.077935 0.081354 0.078074
qa: -0.2801 -0.4603 -0.4088 -0.4089 -0.1054 0.1051 0.0565 -0.1339 -0.2765 -0.2674 -0.3039 0.4175 -0.0113 0.0825 -0.2205 -0.2850 -0.0578 -0.0800 -0.0756 -0.0716 -0.1342 -0.1363 0.3156 0.3196 0.0916 0.0918 0.0927 0.0956 0.0989 0.0879 0.0974 0.0975 0.1164 0.1273 0.1379 0.0930 0.0976 0.0852 0.0999 0.1079 0.0942 0.1013 0.0935 0.1005 0.0940 0.0811 0.0779 0.0814 0.0781
va: 2.1074 2.0525 2.1089 2.1091 3.1068 3.7034 3.7498 3.8464 3.9096 3.9116 3.9052 4.1760 3.7089 3.8507 3.9255 3.9432 3.6553 3.6906 3.9225 3.9182 3.9122 3.9150 4.2252 4.2286 1.0308 1.0363 1.0176 1.0005 0.9994 1.0058 1.0022 1.0017 1.0109 1.0104 1.0194 0.9946 0.9930 1.0100 0.9983 0.9940 1.0026 1.0050 1.0153 1.0048 1.0153 1.0096 1.0070 1.0094 1.0068
dispcorr: -0.021855074 hartree
energy: -1094.901238331633
dipole: -20.60959 21.67053 1.06095 -15.97590 14.51028 -1.46563 -2.16949 2.84099 0.67150
magnitude: 1.92992 au
magnitude: 4.90546 debye
