program: Orca
programVersion: 5.0.2
elementType: O O O O N C C C C C C C C C C C C C C C C C C C H H H H H H H H H H H H H H H H H H H H H H H H H
charge: 0
multiplicity: 1
keywords: wb97x-d3
keywords: def2-TZVPP
keywords: def2/J RIJCOSX
keywords: DEFGRID2
keywords: scfconv7
keywords: smallprint printgap noloewdin
keywords: NOSOSCF
formula: C19H25NO4
InChI: InChI=1/C19H25NO4/c1-11(2)9-14-15(19(14,3)4)18(23)24-10-20-16(21)12-7-5-6-8-13(12)17(20)22/h9,14-15H,5-8,10H2,1-4H3
49 atoms
O  -0.269628 1.260197 0.785726
O  -1.384356 2.062325 -0.986483
O  1.581233 0.184557 -1.576855
O  3.039486 1.681317 2.45738
N  2.02147 1.195518 0.44348
C  -3.797165 0.655341 0.461134
C  -3.333693 -0.169794 -0.697659
C  -2.322748 0.295111 0.323449
C  -4.277179 2.062568 0.209547
C  -4.530842 -0.029209 1.588222
C  -3.636191 -1.6193 -0.815866
C  -1.311775 1.296355 -0.057819
C  -4.680395 -2.120634 -1.480643
C  0.87996 2.047636 0.502252
C  -4.907264 -3.597763 -1.583254
C  -5.700413 -1.268749 -2.170844
C  3.516633 -0.414035 -0.24735
C  3.955685 0.046159 0.925157
C  4.170678 -1.477981 -1.047075
C  5.198215 -0.394843 1.603806
C  5.221785 -2.185549 -0.189319
C  6.055768 -1.19645 0.623083
C  2.270125 0.309893 -0.59719
C  2.998548 1.067267 1.422759
H  -3.294257 0.373482 -1.63806
H  -1.973386 -0.451967 1.028093
H  -3.831445 2.51981 -0.671148
H  -5.358859 2.056204 0.059348
H  -4.072532 2.708877 1.066028
H  -4.470996 0.563237 2.503487
H  -5.588165 -0.145619 1.338519
H  -4.134307 -1.020444 1.807416
H  -2.95022 -2.308769 -0.331859
H  1.018183 2.763861 1.310139
H  0.768229 2.589464 -0.435028
H  -5.874301 -3.877211 -1.156514
H  -4.927073 -3.920599 -2.627683
H  -4.134831 -4.170656 -1.06994
H  -6.705143 -1.502564 -1.809074
H  -5.538688 -0.201275 -2.029061
H  -5.708994 -1.465473 -3.24645
H  3.425141 -2.187376 -1.414746
H  4.627851 -1.035314 -1.938058
H  5.74756 0.469087 1.985911
H  4.940366 -0.998569 2.480228
H  4.721439 -2.881385 0.490613
H  5.870465 -2.786072 -0.82875
H  6.561286 -0.506012 -0.058423
H  6.838398 -1.724877 1.169524
elementType: O N C H
totalener: -1094.87875405 hartree
nucrepener: 2052.31416103 hartree
electener: -3147.19291508 hartree
oneelecener: -5566.97942251 hartree
twoeener: 2419.78650743 hartree
cpcmener: -0.03095709 hartree
kineticenergy: 1090.03939064 hartree
xcener: -105.970236341755 hartree
chargesum: 0.0000000
charge: -0.285109 -0.458781 -0.409775 -0.409954 -0.093795 0.127029 -0.013315 -0.126479 -0.294240 -0.269056 -0.247571 0.419067 -0.040781 0.077929 -0.228429 -0.248905 -0.059961 -0.084546 -0.071797 -0.072449 -0.134402 -0.135996 0.313737 0.322283 0.100510 0.094109 0.095131 0.095118 0.101362 0.100042 0.096276 0.091785 0.120036 0.124294 0.141421 0.093706 0.094279 0.089086 0.095019 0.086592 0.101576 0.093890 0.100108 0.093694 0.100630 0.078595 0.079841 0.077872 0.080324
qa: -0.2851 -0.4588 -0.4098 -0.4100 -0.0938 0.1270 -0.0133 -0.1265 -0.2942 -0.2691 -0.2476 0.4191 -0.0408 0.0779 -0.2284 -0.2489 -0.0600 -0.0845 -0.0718 -0.0724 -0.1344 -0.1360 0.3137 0.3223 0.1005 0.0941 0.0951 0.0951 0.1014 0.1000 0.0963 0.0918 0.1200 0.1243 0.1414 0.0937 0.0943 0.0891 0.0950 0.0866 0.1016 0.0939 0.1001 0.0937 0.1006 0.0786 0.0798 0.0779 0.0803
va: 2.1074 2.0540 2.1084 2.1092 3.0943 3.6829 3.7958 3.8550 3.8999 3.9064 3.8591 4.1811 3.7089 3.8522 3.9285 3.9388 3.6644 3.6959 3.9227 3.9206 3.9138 3.9135 4.2256 4.2273 1.0252 1.0358 1.0179 1.0005 0.9999 1.0030 1.0013 1.0025 1.0072 1.0145 1.0172 0.9963 0.9954 1.0076 0.9980 1.0082 0.9987 1.0152 1.0055 1.0155 1.0055 1.0066 1.0100 1.0070 1.0095
dispcorr: -0.022587364 hartree
energy: -1094.901341418090
dipole: -22.55479 23.39824 0.84345 -16.14451 14.59718 -1.54733 -3.63374 4.13271 0.49897
magnitude: 1.83156 au
magnitude: 4.65545 debye
