program: Orca
programVersion: 5.0.2
elementType: O O O O N C C C C C C C C C C C C C C C C C C C H H H H H H H H H H H H H H H H H H H H H H H H H
charge: 0
multiplicity: 1
keywords: wb97x-d3
keywords: def2-TZVPP
keywords: def2/J RIJCOSX
keywords: DEFGRID2
keywords: scfconv7
keywords: smallprint printgap noloewdin
keywords: NOSOSCF
formula: C19H25NO4
InChI: InChI=1/C19H25NO4/c1-11(2)9-14-15(19(14,3)4)18(23)24-10-20-16(21)12-7-5-6-8-13(12)17(20)22/h9,14-15H,5-8,10H2,1-4H3
49 atoms
O  -0.230647 0.993362 0.235412
O  -1.751387 2.227665 -0.833589
O  2.035991 -0.0587 -2.052641
O  2.583765 1.762035 2.072466
N  2.035805 1.12715 -0.075712
C  -3.787911 0.592408 0.908016
C  -3.679458 -0.055858 -0.437859
C  -2.417038 0.250669 0.351606
C  -4.257512 2.024523 0.979982
C  -4.235595 -0.231549 2.092129
C  -4.039357 -1.467381 -0.67867
C  -1.478754 1.267967 -0.151682
C  -4.821353 -1.934954 -1.657279
C  0.816938 1.836024 -0.24136
C  -5.094164 -3.404208 -1.782269
C  -5.496101 -1.088487 -2.692281
C  3.722256 -0.41721 -0.352358
C  3.880783 0.116034 0.859983
C  4.60911 -1.440154 -0.958369
C  4.958015 -0.240034 1.814757
C  5.903483 -1.536499 -0.148576
C  5.639848 -1.531152 1.356772
C  2.521877 0.187354 -0.979445
C  2.79519 1.101784 1.088809
H  -3.851785 0.624048 -1.26539
H  -1.937696 -0.601318 0.821087
H  -5.336561 2.04415 1.146314
H  -3.789562 2.552031 1.813904
H  -4.060497 2.58897 0.071532
H  -3.939624 0.250553 3.025957
H  -5.32352 -0.326729 2.100517
H  -3.815682 -1.236516 2.096388
H  -3.616271 -2.189838 0.013455
H  0.850189 2.761593 0.333248
H  0.680436 2.07743 -1.294639
H  -4.58599 -3.986424 -1.01343
H  -6.164929 -3.613359 -1.70954
H  -4.772891 -3.781799 -2.756854
H  -5.218242 -1.41417 -3.697964
H  -6.581861 -1.196785 -2.624187
H  -5.268309 -0.027386 -2.613116
H  4.088844 -2.403311 -0.977443
H  4.81871 -1.192021 -2.001628
H  5.679104 0.58217 1.867879
H  4.55142 -0.348659 2.823155
H  6.443364 -2.441568 -0.4304
H  6.550925 -0.69323 -0.405667
H  6.576409 -1.661751 1.900628
H  5.005978 -2.383854 1.616463
elementType: O N C H
totalener: -1094.88129676 hartree
nucrepener: 2034.52528115 hartree
electener: -3129.40657792 hartree
oneelecener: -5531.13787647 hartree
twoeener: 2401.73129855 hartree
cpcmener: -0.03064009 hartree
kineticenergy: 1090.04107465 hartree
xcener: -105.970263925208 hartree
chargesum: 0.0000000
charge: -0.275899 -0.471571 -0.407913 -0.407364 -0.115744 0.110525 0.039552 -0.096512 -0.277876 -0.266049 -0.273663 0.400602 -0.049569 0.091963 -0.217224 -0.250328 -0.066964 -0.074591 -0.072969 -0.071663 -0.135681 -0.135766 0.318684 0.317912 0.095388 0.086092 0.094675 0.098333 0.092975 0.097767 0.096563 0.087557 0.117377 0.136670 0.124719 0.087732 0.092595 0.092848 0.094697 0.096085 0.088958 0.101259 0.093697 0.100350 0.093846 0.081141 0.077934 0.080600 0.078251
qa: -0.2759 -0.4716 -0.4079 -0.4074 -0.1157 0.1105 0.0396 -0.0965 -0.2779 -0.2660 -0.2737 0.4006 -0.0496 0.0920 -0.2172 -0.2503 -0.0670 -0.0746 -0.0730 -0.0717 -0.1357 -0.1358 0.3187 0.3179 0.0954 0.0861 0.0947 0.0983 0.0930 0.0978 0.0966 0.0876 0.1174 0.1367 0.1247 0.0877 0.0926 0.0928 0.0947 0.0961 0.0890 0.1013 0.0937 0.1004 0.0938 0.0811 0.0779 0.0806 0.0783
va: 2.1133 2.0328 2.1087 2.1096 3.1295 3.6834 3.7665 3.8717 3.9025 3.9118 3.8723 4.1399 3.7650 3.8812 3.9209 3.9424 3.6603 3.6797 3.9218 3.9196 3.9135 3.9157 4.2178 4.2200 1.0299 1.0358 0.9999 0.9993 1.0197 1.0020 1.0022 1.0060 1.0108 1.0005 1.0083 1.0090 0.9963 0.9965 0.9971 0.9971 1.0106 1.0050 1.0150 1.0045 1.0155 1.0094 1.0068 1.0095 1.0069
dispcorr: -0.021495860 hartree
energy: -1094.902792623805
dipole: -21.11529 22.28216 1.16687 -15.42483 13.79258 -1.63225 0.25325 0.35135 0.60459
magnitude: 2.09556 au
magnitude: 5.32649 debye
