program: Orca
programVersion: 5.0.2
elementType: O O O O N C C C C C C C C C C C C C C C C C C C H H H H H H H H H H H H H H H H H H H H H H H H H
charge: 0
multiplicity: 1
keywords: wb97x-d3
keywords: def2-TZVPP
keywords: def2/J RIJCOSX
keywords: DEFGRID2
keywords: scfconv7
keywords: smallprint printgap noloewdin
keywords: NOSOSCF
formula: C19H25NO4
InChI: InChI=1/C19H25NO4/c1-11(2)9-14-15(19(14,3)4)18(23)24-10-20-16(21)12-7-5-6-8-13(12)17(20)22/h9,14-15H,5-8,10H2,1-4H3
49 atoms
O  -0.542308 1.271778 0.691555
O  -1.756001 2.620458 1.986564
O  1.913734 1.751602 -1.5344
O  2.012731 -0.080225 2.619835
N  1.745114 1.138711 0.680429
C  -3.34823 1.061594 -0.736959
C  -2.825767 -0.235746 -0.185159
C  -2.879212 0.978691 0.706002
C  -2.517347 1.784627 -1.768755
C  -4.833462 1.23218 -0.937411
C  -3.707012 -1.390142 0.110039
C  -1.693409 1.709954 1.193523
C  -3.741046 -2.526583 -0.591492
C  0.652433 1.955351 1.070101
C  -4.633507 -3.661518 -0.191726
C  -2.898861 -2.777175 -1.806499
C  3.276962 -0.017416 -0.592381
C  3.306261 -0.552464 0.62922
C  4.117931 -0.451821 -1.733888
C  4.200851 -1.652865 1.061125
C  4.769283 -1.797966 -1.408222
C  5.305654 -1.851542 0.021652
C  2.258338 1.062157 -0.609814
C  2.305398 0.142388 1.474141
H  -1.836673 -0.495041 -0.547755
H  -3.685409 1.004916 1.432379
H  -1.45277 1.566584 -1.694914
H  -2.836687 1.487527 -2.769978
H  -2.645438 2.866619 -1.693857
H  -5.147269 0.786842 -1.883872
H  -5.420219 0.768873 -0.144573
H  -5.098822 2.291021 -0.966376
H  -4.361994 -1.297645 0.971924
H  0.690693 2.115089 2.146651
H  0.71034 2.918885 0.563896
H  -4.055455 -4.574418 -0.023137
H  -5.192934 -3.446647 0.718795
H  -5.35145 -3.894468 -0.982749
H  -2.465002 -1.870243 -2.2249
H  -2.078413 -3.464649 -1.58131
H  -3.490491 -3.251538 -2.592841
H  3.515495 -0.521678 -2.642828
H  4.876859 0.31098 -1.935202
H  4.625054 -1.432876 2.043786
H  3.613351 -2.568117 1.186797
H  4.035034 -2.596059 -1.549323
H  5.577923 -1.990399 -2.114683
H  6.066763 -1.077388 0.153256
H  5.800878 -2.807773 0.196251
elementType: O N C H
totalener: -1094.87859619 hartree
nucrepener: 2092.71837801 hartree
electener: -3187.59697420 hartree
oneelecener: -5647.10052972 hartree
twoeener: 2459.50355552 hartree
cpcmener: -0.03130971 hartree
kineticenergy: 1090.04469924 hartree
xcener: -105.969772731585 hartree
chargesum: 0.0000000
charge: -0.267772 -0.464193 -0.412368 -0.406388 -0.113600 0.138505 0.048952 -0.156877 -0.281144 -0.266765 -0.304631 0.418003 -0.015799 0.073693 -0.226671 -0.264977 -0.054611 -0.073958 -0.072627 -0.073986 -0.135935 -0.136096 0.311137 0.318857 0.102032 0.093568 0.082399 0.094500 0.102582 0.094676 0.089401 0.098327 0.119728 0.126745 0.142671 0.093752 0.087978 0.094106 0.090610 0.103054 0.093859 0.093523 0.101003 0.094340 0.102187 0.078596 0.080362 0.078412 0.080841
qa: -0.2678 -0.4642 -0.4124 -0.4064 -0.1136 0.1385 0.0490 -0.1569 -0.2811 -0.2668 -0.3046 0.4180 -0.0158 0.0737 -0.2267 -0.2650 -0.0546 -0.0740 -0.0726 -0.0740 -0.1359 -0.1361 0.3111 0.3189 0.1020 0.0936 0.0824 0.0945 0.1026 0.0947 0.0894 0.0983 0.1197 0.1267 0.1427 0.0938 0.0880 0.0941 0.0906 0.1031 0.0939 0.0935 0.1010 0.0943 0.1022 0.0786 0.0804 0.0784 0.0808
va: 2.0984 2.0392 2.0986 2.1112 3.1366 3.6831 3.7220 3.9394 3.9085 3.9068 3.8770 4.1524 3.7007 3.8849 3.9294 3.9468 3.6874 3.6706 3.9199 3.9199 3.9152 3.9145 4.2023 4.2156 1.0148 1.0343 1.0177 1.0017 1.0005 1.0031 1.0034 1.0025 1.0087 1.0120 0.9992 0.9944 1.0087 0.9964 1.0047 0.9958 0.9993 1.0154 1.0044 1.0152 1.0049 1.0064 1.0094 1.0065 1.0097
dispcorr: -0.023052896 hartree
energy: -1094.901649082265
dipole: -14.61608 15.91923 1.30315 -18.01849 16.15763 -1.86086 -15.03739 13.47556 -1.56183
magnitude: 2.75687 au
magnitude: 7.00741 debye
