program: Orca
programVersion: 5.0.2
elementType: O O O O N C C C C C C C C C C C C C C C C C C C H H H H H H H H H H H H H H H H H H H H H H H H H
charge: 0
multiplicity: 1
keywords: wb97x-d3
keywords: def2-TZVPP
keywords: def2/J RIJCOSX
keywords: DEFGRID2
keywords: scfconv7
keywords: smallprint printgap noloewdin
keywords: NOSOSCF
formula: C19H25NO4
InChI: InChI=1/C19H25NO4/c1-11(2)9-14-15(19(14,3)4)18(23)24-10-20-16(21)12-7-5-6-8-13(12)17(20)22/h9,14-15H,5-8,10H2,1-4H3
49 atoms
O  -0.531864 1.750178 1.443661
O  -0.384518 -0.480664 1.54845
O  1.464881 2.693794 -0.618125
O  2.520231 -0.372666 2.56836
N  1.792648 1.379689 1.24733
C  -2.214647 0.200214 -1.053799
C  -2.869596 -0.72231 -0.060807
C  -2.232051 0.552181 0.424147
C  -0.927138 -0.242018 -1.704826
C  -3.070424 1.053773 -1.954788
C  -4.338094 -0.871163 0.032647
C  -0.976661 0.510962 1.195262
C  -5.023477 -2.011963 -0.091331
C  0.740028 1.906571 2.060335
C  -6.514471 -2.035182 0.061632
C  -4.402835 -3.346149 -0.374613
C  2.919881 0.761093 -0.667191
C  3.219281 -0.143504 0.265699
C  3.436785 0.762306 -2.056132
C  4.114452 -1.308152 0.06518
C  4.611217 -0.21135 -2.16506
C  4.33574 -1.523891 -1.433042
C  1.984734 1.747594 -0.079878
C  2.49819 0.207504 1.512656
H  -2.29524 -1.61894 0.147623
H  -2.893692 1.371894 0.685896
H  -0.308166 0.618147 -1.969865
H  -0.33319 -0.905572 -1.077741
H  -1.147319 -0.781596 -2.627803
H  -3.369918 0.489673 -2.840384
H  -3.976202 1.409025 -1.465243
H  -2.513278 1.928778 -2.294312
H  -4.899382 0.037484 0.23181
H  0.777565 1.429389 3.038889
H  0.855527 2.979177 2.189756
H  -6.997134 -2.392127 -0.851743
H  -6.815272 -2.722897 0.856429
H  -6.920938 -1.051641 0.296218
H  -3.347809 -3.291592 -0.634852
H  -4.500921 -4.011407 0.487045
H  -4.92079 -3.837916 -1.201267
H  2.628513 0.474377 -2.736322
H  3.734703 1.770668 -2.3518
H  5.065699 -1.124726 0.574654
H  3.688959 -2.199921 0.530468
H  4.826519 -0.406703 -3.216051
H  5.504945 0.256226 -1.742834
H  5.164243 -2.216881 -1.582844
H  3.447992 -1.997714 -1.861233
elementType: O N C H
totalener: -1094.86865446 hartree
nucrepener: 2149.09962361 hartree
electener: -3243.96827807 hartree
oneelecener: -5760.73772824 hartree
twoeener: 2516.76945017 hartree
cpcmener: -0.03998935 hartree
kineticenergy: 1090.04892544 hartree
xcener: -105.975723452531 hartree
chargesum: -0.0000000
charge: -0.276874 -0.471850 -0.433187 -0.427295 -0.105744 0.140916 0.024397 -0.127446 -0.283657 -0.269533 -0.297591 0.404362 -0.031185 0.084594 -0.224309 -0.258496 -0.104499 -0.017530 -0.061989 -0.073382 -0.137983 -0.134318 0.326040 0.308630 0.092758 0.101130 0.091261 0.090911 0.106309 0.097647 0.090536 0.099417 0.122702 0.136364 0.144859 0.094556 0.093820 0.089308 0.091757 0.100318 0.093627 0.101519 0.094970 0.101435 0.093047 0.081069 0.078663 0.080979 0.078967
qa: -0.2769 -0.4718 -0.4332 -0.4273 -0.1057 0.1409 0.0244 -0.1274 -0.2837 -0.2695 -0.2976 0.4044 -0.0312 0.0846 -0.2243 -0.2585 -0.1045 -0.0175 -0.0620 -0.0734 -0.1380 -0.1343 0.3260 0.3086 0.0928 0.1011 0.0913 0.0909 0.1063 0.0976 0.0905 0.0994 0.1227 0.1364 0.1449 0.0946 0.0938 0.0893 0.0918 0.1003 0.0936 0.1015 0.0950 0.1014 0.0930 0.0811 0.0787 0.0810 0.0790
va: 2.1126 2.0339 2.0669 2.0805 3.0807 3.6866 3.7925 3.8380 3.9013 3.8975 3.8761 4.2031 3.7252 3.8905 3.9241 3.9440 3.7181 3.6079 3.9111 3.9104 3.9214 3.9144 4.1558 4.1954 1.0300 1.0332 1.0092 1.0128 1.0019 1.0021 1.0037 1.0025 1.0081 1.0133 0.9929 0.9966 0.9948 1.0086 1.0074 0.9959 0.9980 1.0065 1.0160 1.0037 1.0159 1.0094 1.0060 1.0094 1.0075
dispcorr: -0.025287470 hartree
energy: -1094.893941934727
dipole: -18.13514 18.48869 0.35355 -15.05830 14.89975 -0.15854 -18.46307 16.83106 -1.63201
magnitude: 1.67738 au
magnitude: 4.26355 debye
