program: Gaussian 09
title: 000071350
version: EM64L-G09RevD.01
frameworkgroup: C1[X(C23H28N2O3S)]
method: RPBEPBE
basis: SDD
operation: Freq
keyword: #p
keyword: freq=noraman
keyword: PBEPBE/SDD
title: #p freq=noraman PBEPBE/SDD
converged: YES YES NO NO
title: Mulliken charges:
elementType: S O O O N N C C C C C C C C C C C C C C C C C C C C C C C H H H H H H H H H H H H H H H H H H H H H H H H H H H H
charge: 0.254438 -0.422303 -0.232312 -0.260318 -0.062292 -0.469897 -0.248652 -0.486912 -0.486907 -0.430959 0.458760 0.302071 -0.400610 -0.411913 -0.705150 -0.762637 0.092281 -0.250242 -0.727165 -0.724957 0.225509 -0.200700 0.469601 -0.313526 0.561435 -0.646562 -0.365954 -0.416602 -0.221098 0.236822 0.229362 0.238800 0.238889 0.229370 0.210353 0.223151 0.262150 0.216927 0.221818 0.253728 0.263127 0.272277 0.276176 0.225336 0.214922 0.223565 0.218119 0.222959 0.225309 0.318257 0.232897 0.377757 0.260258 0.225138 0.311192 0.227337 0.227577
chargesum: 0.00000
title: Mulliken charges with hydrogens summed into heavy atoms:
elementType: S O O O N N C C C C C C C C C C C C C C C C C C C C C C C
charge: 0.254438 -0.044546 -0.232312 -0.260318 -0.062292 -0.151640 -0.011830 -0.018750 -0.018649 0.002546 0.458760 0.302071 0.078467 0.063633 -0.169745 -0.486461 0.092281 -0.250242 -0.063343 -0.058569 0.225509 0.032198 0.469601 -0.053268 0.561435 -0.421424 -0.054763 -0.189265 0.006478
polarizability: 5.44312576e+02 -1.98263007e+01 3.12298624e+02 -5.28142207e+00 -2.35345186e+00 1.78132507e+02
1716.lowfreq: -17.5995 -1.3109 -0.0016 -0.0015 0.0001 1.2161 4.0306 10.7048 22.3166
frequency: -16.1037 10.1739 22.2837 23.2716 39.4774 43.8105 50.2515 54.0030 65.7750 73.8615 79.5080 93.3722 111.8671 118.9007 130.1113 132.1951 144.8392 161.5191 176.9989 194.7420 212.1170 237.9047 240.8131 256.1279 262.2114 279.6794 293.8983 302.7359 312.4291 326.7811 332.8906 338.6699 348.2132 377.6721 436.2745 449.2511 460.2314 490.4534 513.1135 542.5673 543.6983 562.2033 565.5200 591.5173 600.1240 604.8032 609.5817 666.1914 686.2284 686.6629 695.0952 697.5518 715.9348 719.6421 743.2323 755.6158 768.7361 780.1246 792.5418 792.7925 808.9725 830.7317 836.0181 860.1270 861.3599 886.3747 892.8650 901.6458 917.5082 923.3274 925.9337 945.5653 949.6943 958.9867 975.9043 983.3750 987.5300 998.6055 998.9915 1005.9085 1018.0858 1038.0182 1040.3156 1074.2316 1079.4633 1085.1046 1086.0717 1098.3124 1113.5801 1138.7406 1145.8775 1173.3223 1179.3152 1185.0306 1208.1435 1209.2086 1210.1003 1216.8918 1237.9602 1240.9623 1241.7409 1250.6651 1266.7619 1271.5890 1274.0430 1294.8289 1304.0339 1308.3793 1317.4779 1319.8962 1324.7280 1339.6785 1351.6780 1364.6368 1386.7522 1393.4490 1394.8439 1405.5592 1440.7378 1447.8668 1460.5722 1461.8258 1474.4327 1475.4415 1477.3984 1477.7839 1483.0355 1485.7367 1488.2930 1493.4786 1501.2704 1523.4546 1589.2779 1610.0512 1623.7156 1627.3952 1636.0489 2976.3539 2977.2573 2993.1995 3009.0533 3014.2602 3014.3665 3019.2934 3024.7738 3027.2371 3040.1558 3055.8814 3057.5427 3074.4092 3074.9394 3080.3130 3082.8986 3086.2841 3095.3534 3102.2288 3109.4742 3111.2814 3133.0348 3136.9572 3158.7640 3202.8028 3236.7655 3516.1183 3517.6541
redmass: 3.6265 5.4206 5.3010 4.5795 3.0576 8.3693 4.7335 5.7541 3.3745 5.9926 2.5384 3.7322 4.5947 3.3100 3.7183 3.4092 4.7005 2.6070 1.5051 2.2653 2.0549 3.2738 3.2034 2.6122 3.8665 1.8018 3.5002 5.2784 2.5092 3.7972 5.5186 4.3549 5.4688 3.5235 2.3021 2.9485 5.0614 5.1301 5.4531 3.2195 3.8749 3.8269 6.0874 3.6875 1.2971 4.2090 2.9137 1.3507 5.3446 4.0733 2.4809 1.9008 3.5045 3.0965 4.6442 1.3135 2.4211 1.2540 1.3272 1.9654 1.4359 3.9700 2.7446 1.7489 2.5168 2.8673 2.4136 1.7992 2.6528 1.3940 1.7430 2.1751 3.5137 2.9495 2.7979 5.2996 1.1890 2.6047 1.3253 2.1725 1.8352 1.5884 2.4702 3.1720 1.4584 2.8031 2.8352 1.6609 2.1049 2.1510 1.4795 1.2983 2.1264 1.1689 1.4585 2.8204 1.4126 1.1201 1.2950 1.2386 1.4517 1.3876 1.1564 1.7645 1.8417 1.7079 2.5394 1.7101 1.9264 1.4084 1.4335 1.7361 1.4237 1.7111 4.1470 1.2302 1.2139 3.2135 1.0942 1.0846 1.0956 1.0740 1.1184 1.1643 1.0505 1.0713 1.0554 2.3927 1.1056 5.1516 4.8986 2.3717 5.5259 6.0626 5.4315 4.9757 7.2789 1.0365 1.0366 1.0607 1.0610 1.0606 1.0570 1.0574 1.0798 1.0708 1.0975 1.0994 1.0994 1.0979 1.0977 1.1069 1.1028 1.1022 1.1083 1.0913 1.1071 1.0907 1.0883 1.0875 1.0959 1.0948 1.0956 1.0640 1.0762
irintensity: 0.1305 0.1071 0.0202 0.0818 0.0045 1.2960 0.0017 0.0708 0.3408 5.6181 0.3417 1.1212 0.0471 4.0651 2.7106 0.1775 0.0731 0.4946 0.4669 7.6665 1.0811 0.6986 0.9099 1.0471 4.9770 2.7403 6.3521 2.6687 2.6781 1.0981 5.6587 1.4873 8.4051 1.8012 2.9179 9.8836 1.1631 22.3809 62.2138 6.2389 2.4187 5.0906 3.4045 3.1556 79.3881 8.8533 30.4433 39.5962 10.4926 0.9319 10.9792 34.4436 32.3697 13.1980 1.4130 44.3847 0.2934 0.1417 14.9776 106.5942 35.2389 0.1678 13.0270 20.2583 8.8964 1.0081 1.2082 8.0143 1.6080 7.1971 3.2753 0.8397 24.0492 17.1412 10.7575 4.7964 46.8086 29.6875 12.5624 3.4484 0.1710 48.1438 324.0582 1.4901 0.4397 1.5543 6.0645 19.0684 23.0963 46.7957 3.3482 1.5095 39.6302 14.5517 17.4287 5.8065 21.6909 0.0045 0.9398 2.0131 8.3538 4.4747 4.4824 154.5138 3.5883 12.6547 8.0119 14.4785 2.5491 1.9975 34.3900 17.2130 4.0481 5.9170 232.0909 8.7042 17.9697 70.6440 23.5578 6.8960 1.6936 2.0496 84.9191 6.5945 4.2486 54.8076 5.8189 143.3543 47.1728 65.1698 123.9601 244.5438 26.9312 189.6355 162.9152 39.8840 86.8247 35.5371 14.1371 18.5490 5.2979 34.7762 36.7869 71.8841 16.0468 28.1956 10.9827 2.8062 30.3158 28.3103 53.1775 15.6136 4.3084 82.3820 15.0885 11.2922 87.5229 4.9159 25.4449 0.0595 19.2817 12.8172 2.3264 30.7371 12.3007
temp: 298.150 k
press: 1.00000 atm
elementType: 16 8 8 8 7 7 6 6 6 6 6 6 6 6 6 6 6 6 6 6 6 6 6 6 6 6 6 6 6 1 1 1 1 1 1 1 1 1 1 1 1 1 1 1 1 1 1 1 1 1 1 1 1 1 1 1 1
symmnumber: 1
zpe: 1214593.4 jmol-1
zpe.correction: 0.462614 hartree
zpe.thermalcorrener: 0.491554 hartree
zpe.thermalcorrenthalpy: 0.492498 hartree
zpe.thermalcorrgfe: 0.399119 hartree
zpe.sumelectzpe: -1624.330629 hartree
zpe.sumelectthermal: -1624.301689 hartree
zpe.sumelectthermalent: -1624.300745 hartree
zpe.sumelectthermalfe: -1624.394124 hartree
dipole: -0.4210 1.4136 0.2439
dipole: 1.4949
quadrupole: -156.0477 -178.0887 -184.0488
quadrupole: 4.4717 1.3771 0.3061
quadrupole: 16.6807 -5.3603 -11.3204 4.4717 1.3771 0.3061
hfenergy: -1624.7932432 hartree
pointgroup: C01 [X(C23H28N2O3S1)]
dipole: 0.1822239 -0.5417782 0.1385664 debye
polarizability: 545.0875922|-11.3353488|310.8856768|12.2175252|-7.2820681|178.7704382 unknown
InChI: InChI=1S/C23H28N2O3S/c1-3-23(4-2,22(27)28)14-20(26)24-18-10-5-7-16(13-18)11-12-21-25-19(15-29-21)17-8-6-9-17/h5,7,10-13,15,17,24,27H,3-4,6,8-9,14H2,1-2H3
charge 0 multiplicity 1
57 atoms
S  6.707999 2.231928 0.011938
O  -7.738324 -2.190326 0.235923
O  -5.668251 -3.191695 0.012889
O  -4.067324 1.67953 -0.402223
N  5.412572 -0.107655 0.051764
N  -2.149525 0.351213 -0.182087
C  7.216282 -1.84582 0.169178
C  6.577853 -2.777555 1.269742
C  6.65809 -2.845376 -0.915615
C  6.503589 -3.928048 0.207549
C  6.779773 -0.411508 0.107556
C  -5.833435 -0.697526 -0.053428
C  -6.564469 0.00385 -1.253029
C  -6.204245 0.068287 1.265274
C  -4.297738 -0.795398 -0.270789
C  7.623093 0.696696 0.096454
C  -6.347907 -2.1392 0.060306
C  5.162912 1.197491 -0.002701
C  -6.412295 -0.688693 -2.623994
C  -5.582378 -0.500644 2.558177
C  -3.53207 0.53629 -0.286297
C  3.871233 1.850849 -0.072132
C  -1.108074 1.323035 -0.213013
C  2.684265 1.15902 -0.08351
C  1.335562 1.732572 -0.158574
C  0.225542 0.846445 -0.140326
C  -1.350048 2.719431 -0.307643
C  1.077981 3.132962 -0.253459
C  -0.245647 3.602237 -0.326344
H  8.319199 -1.897028 0.210972
H  7.171017 -2.950292 2.182786
H  5.574713 -2.41023 1.545245
H  5.6789 -2.498133 -1.286703
H  7.31654 -3.072938 -1.77003
H  7.381037 -4.597006 0.259981
H  5.588334 -4.541573 0.192908
H  -6.171796 1.034213 -1.30414
H  -7.638075 0.064365 -0.996074
H  -7.305968 0.060645 1.35467
H  -5.890923 1.118161 1.126684
H  -3.865688 -1.457853 0.502621
H  -4.106896 -1.31396 -1.230832
H  8.710481 0.711403 0.131422
H  -6.785141 -1.730143 -2.60579
H  -5.362972 -0.707523 -2.97126
H  -6.995523 -0.142284 -3.387076
H  -4.478717 -0.437213 2.552094
H  -5.936254 0.074956 3.432458
H  -5.862216 -1.558489 2.722135
H  -1.837599 -0.61934 -0.090219
H  3.88389 2.945923 -0.116621
H  -8.018716 -3.143048 0.304073
H  2.752365 0.063552 -0.03252
H  0.414511 -0.233953 -0.069159
H  -2.375656 3.08568 -0.365075
H  1.907422 3.84714 -0.27274
H  -0.434385 4.678977 -0.399897
