program: Orca
programVersion: 5.0.2
elementType: O O O O N C C C C C C C C C C C C C C C C C C C H H H H H H H H H H H H H H H H H H H H H H H H H
charge: 0
multiplicity: 1
keywords: wb97x-d3
keywords: def2-TZVPP
keywords: def2/J RIJCOSX
keywords: DEFGRID2
keywords: scfconv7
keywords: smallprint printgap noloewdin
keywords: NOSOSCF
formula: C19H25NO4
InChI: InChI=1/C19H25NO4/c1-11(2)9-14-15(19(14,3)4)18(23)24-10-20-16(21)12-7-5-6-8-13(12)17(20)22/h9,14-15H,5-8,10H2,1-4H3
49 atoms
O  0.249986 0.422079 0.03497
O  1.617387 1.988468 -0.777131
O  -2.534898 1.853405 1.482076
O  -2.126062 -1.448143 -1.623347
N  -2.028114 0.397638 -0.238201
C  3.581166 1.043315 1.445652
C  3.899726 0.229321 0.237213
C  2.453753 0.322923 0.733091
C  3.959841 0.4550 2.785552
C  3.683327 2.548928 1.423187
C  4.343482 0.825844 -1.042554
C  1.443273 1.02339 -0.081262
C  4.556428 0.149418 -2.172338
C  -0.823942 0.992187 -0.700994
C  5.068844 0.839371 -3.400554
C  4.297039 -1.317191 -2.335603
C  -3.855935 -0.127851 1.058038
C  -3.735522 -1.096519 0.1508
C  -4.912357 -0.056094 2.097913
C  -4.65078 -2.257445 0.017809
C  -5.624941 -1.406548 2.197949
C  -5.927423 -1.996168 0.819901
C  -2.760474 0.857377 0.854245
C  -2.552338 -0.806806 -0.704461
H  4.337065 -0.741378 0.450896
H  2.074578 -0.558937 1.236406
H  3.88781 -0.633506 2.790746
H  4.98733 0.718488 3.042966
H  3.309859 0.834123 3.576221
H  3.38367 2.995988 0.480655
H  3.05188 2.978738 2.202625
H  4.71165 2.850205 1.631364
H  4.536014 1.892058 -1.048013
H  -0.706428 0.786548 -1.765273
H  -0.873524 2.069751 -0.546941
H  4.361076 0.743719 -4.227704
H  5.243043 1.900962 -3.231177
H  6.007724 0.394086 -3.739961
H  3.592026 -1.488407 -3.152857
H  5.213125 -1.851118 -2.601237
H  3.879574 -1.784447 -1.446086
H  -4.48041 0.235321 3.057989
H  -5.620232 0.738166 1.839505
H  -4.877152 -2.444233 -1.034217
H  -4.145373 -3.159989 0.376501
H  -4.995716 -2.103848 2.758536
H  -6.547719 -1.295108 2.769144
H  -6.565322 -1.303503 0.263328
H  -6.494307 -2.922395 0.924567
totalener: -1094.85316742 hartree
nucrepener: 2057.72180042 hartree
electener: -3152.57496785 hartree
oneelecener: -5577.45951743 hartree
twoeener: 2424.88454959 hartree
kineticenergy: 1090.09383814 hartree
xcener: -105.971258255894 hartree
chargesum: 0.0000000
charge: -0.268530 -0.388843 -0.316757 -0.317159 -0.125324 0.122479 -0.062888 -0.049969 -0.236879 -0.284468 -0.145440 0.334517 -0.030160 0.092576 -0.213037 -0.248736 -0.090271 -0.091371 -0.072499 -0.077103 -0.135373 -0.134285 0.260641 0.265776 0.088670 0.077367 0.070089 0.087892 0.090877 0.102759 0.089500 0.091857 0.084783 0.122965 0.120807 0.085373 0.078536 0.081401 0.088961 0.088679 0.077714 0.094884 0.092354 0.094019 0.093367 0.075454 0.079675 0.075410 0.079711
qa: -0.2685 -0.3888 -0.3168 -0.3172 -0.1253 0.1225 -0.0629 -0.0500 -0.2369 -0.2845 -0.1454 0.3345 -0.0302 0.0926 -0.2130 -0.2487 -0.0903 -0.0914 -0.0725 -0.0771 -0.1354 -0.1343 0.2606 0.2658 0.0887 0.0774 0.0701 0.0879 0.0909 0.1028 0.0895 0.0919 0.0848 0.1230 0.1208 0.0854 0.0785 0.0814 0.0890 0.0887 0.0777 0.0949 0.0924 0.0940 0.0934 0.0755 0.0797 0.0754 0.0797
va: 2.1151 2.0958 2.1978 2.1974 3.1167 3.7792 3.8610 3.8630 3.8959 3.9127 3.8936 4.1542 3.7805 3.9040 3.9446 3.9509 3.6244 3.6293 3.9260 3.9271 3.8995 3.8971 4.2789 4.2764 1.0048 1.0295 1.0074 1.0046 1.0053 1.0218 1.0034 0.9980 1.0154 1.0024 1.0072 0.9991 1.0121 0.9970 0.9996 0.9988 1.0101 1.0189 1.0083 1.0190 1.0082 1.0086 1.0118 1.0088 1.0119
dispcorr: -0.022086034 hartree
energy: -1094.875253458310
dipole: 18.01995 -18.92683 -0.90688 -4.73361 3.69310 -1.04050 2.33483 -1.61519 0.71964
magnitude: 1.55659 au
magnitude: 3.95654 debye
