program: Orca
programVersion: 5.0.2
elementType: O O O O N C C C C C C C C C C C C C C C C C C C H H H H H H H H H H H H H H H H H H H H H H H H H
charge: 0
multiplicity: 1
keywords: wb97x-d3
keywords: def2-TZVPP
keywords: def2/J RIJCOSX
keywords: DEFGRID2
keywords: scfconv7
keywords: smallprint printgap noloewdin
keywords: NOSOSCF
formula: C19H25NO4
InChI: InChI=1/C19H25NO4/c1-11(2)9-14-15(19(14,3)4)18(23)24-10-20-16(21)12-7-5-6-8-13(12)17(20)22/h9,14-15H,5-8,10H2,1-4H3
49 atoms
O  1.1609 -1.321837 -0.585372
O  2.645758 -2.619154 -1.627226
O  -1.542333 -0.763422 -2.631827
O  -1.089578 -1.725402 1.788053
N  -1.09641 -1.580902 -0.516855
C  3.597912 0.059517 0.606954
C  3.02017 0.921513 -0.472327
C  3.363252 -0.52583 -0.776746
C  5.049715 0.283116 0.963039
C  2.77027 -0.390569 1.787636
C  1.632596 1.455329 -0.498996
C  2.381787 -1.599925 -1.047804
C  1.106404 2.29964 0.38857
C  0.120297 -2.264103 -0.789439
C  -0.295842 2.809513 0.230817
C  1.829748 2.813421 1.595889
C  -2.768917 -0.006517 -0.689372
C  -2.629165 -0.279497 0.607536
C  -3.754334 0.945034 -1.259955
C  -3.417997 0.342147 1.700012
C  -4.797533 1.300951 -0.198841
C  -4.154724 1.571176 1.161746
C  -1.762645 -0.790068 -1.453406
C  -1.533209 -1.271375 0.770793
H  3.737378 1.602268 -0.928271
H  4.261725 -0.684152 -1.361791
H  5.144693 1.070143 1.714524
H  5.495741 -0.623716 1.374971
H  5.643183 0.580358 0.097502
H  3.050101 -1.402291 2.087327
H  2.965623 0.261426 2.640478
H  1.700339 -0.376432 1.605078
H  1.028262 1.180204 -1.357089
H  0.230026 -3.106419 -0.106295
H  0.110198 -2.628707 -1.816084
H  -0.319521 3.901566 0.198039
H  -0.768234 2.435215 -0.67728
H  -0.91762 2.509268 1.079521
H  1.347629 2.473948 2.516204
H  2.872113 2.504589 1.629711
H  1.806475 3.905822 1.617914
H  -3.229158 1.842409 -1.604747
H  -4.224672 0.519486 -2.149328
H  -4.125777 -0.390263 2.101536
H  -2.763485 0.60701 2.53365
H  -5.371377 2.170464 -0.522528
H  -5.510416 0.476477 -0.105587
H  -4.91193 1.891647 1.878625
H  -3.446944 2.400254 1.066385
totalener: -1094.84734280 hartree
nucrepener: 2223.76419375 hartree
electener: -3318.61153655 hartree
oneelecener: -5908.94145706 hartree
twoeener: 2590.32992051 hartree
kineticenergy: 1090.09860503 hartree
xcener: -105.972966861629 hartree
chargesum: 0.0000000
charge: -0.255279 -0.358863 -0.313020 -0.317086 -0.106064 0.045021 -0.010848 -0.068170 -0.246004 -0.258495 -0.194207 0.312789 -0.007389 0.073233 -0.242625 -0.255752 -0.103952 -0.053901 -0.070788 -0.088547 -0.125414 -0.145355 0.233012 0.238490 0.099680 0.086620 0.079932 0.096590 0.073703 0.105191 0.077035 0.105068 0.098264 0.126189 0.127828 0.102182 0.081235 0.076521 0.095587 0.085400 0.096077 0.092662 0.098400 0.099495 0.098326 0.080916 0.076498 0.083833 0.075982
qa: -0.2553 -0.3589 -0.3130 -0.3171 -0.1061 0.0450 -0.0108 -0.0682 -0.2460 -0.2585 -0.1942 0.3128 -0.0074 0.0732 -0.2426 -0.2558 -0.1040 -0.0539 -0.0708 -0.0885 -0.1254 -0.1454 0.2330 0.2385 0.0997 0.0866 0.0799 0.0966 0.0737 0.1052 0.0770 0.1051 0.0983 0.1262 0.1278 0.1022 0.0812 0.0765 0.0956 0.0854 0.0961 0.0927 0.0984 0.0995 0.0983 0.0809 0.0765 0.0838 0.0760
va: 2.0831 2.1484 2.1926 2.1903 3.1127 3.7371 3.7880 3.8300 3.9192 3.8981 3.8897 4.2466 3.6970 3.9219 3.9604 3.9459 3.5870 3.5693 3.9198 3.9148 3.8841 3.8973 4.2601 4.2634 1.0061 1.0276 1.0064 1.0029 1.0091 1.0060 1.0016 1.0072 1.0237 0.9994 1.0090 1.0019 1.0074 0.9939 0.9961 1.0078 1.0043 1.0097 1.0201 1.0082 1.0170 1.0124 1.0093 1.0145 1.0110
dispcorr: -0.029102519 hartree
energy: -1094.876445319671
dipole: 3.27087 -4.41643 -1.14556 22.26459 -20.72080 1.54379 13.40794 -12.49032 0.91762
magnitude: 2.13017 au
magnitude: 5.41445 debye
