program: Orca
programVersion: 5.0.2
elementType: O O O O N C C C C C C C C C C C C C C C C C C C H H H H H H H H H H H H H H H H H H H H H H H H H
charge: 0
multiplicity: 1
keywords: wb97x-d3
keywords: def2-TZVPP
keywords: def2/J RIJCOSX
keywords: DEFGRID2
keywords: scfconv7
keywords: smallprint printgap noloewdin
keywords: NOSOSCF
formula: C19H25NO4
InChI: InChI=1/C19H25NO4/c1-11(2)9-14-15(19(14,3)4)18(23)24-10-20-16(21)12-7-5-6-8-13(12)17(20)22/h9,14-15H,5-8,10H2,1-4H3
49 atoms
O  0.545597 -0.935791 -0.229091
O  2.126939 -1.277495 1.309226
O  -1.958445 -2.604276 -1.777769
O  -2.064598 0.212371 1.795646
N  -1.678965 -1.364444 0.150653
C  4.07335 0.145885 -0.636432
C  3.356979 1.308503 -0.020654
C  2.561513 0.131527 -0.593708
C  4.665675 0.36762 -2.009611
C  4.908305 -0.783809 0.209852
C  3.37708 1.605613 1.422241
C  1.773467 -0.76127 0.281453
C  3.506634 2.815062 1.974478
C  -0.358545 -1.752313 0.50256
C  3.487826 2.973628 3.466079
C  3.678026 4.099807 1.2215
C  -3.611763 -0.996708 -1.04357
C  -3.641497 -0.171242 0.002176
C  -4.668917 -1.098185 -2.080177
C  -4.746127 0.767483 0.319104
C  -5.604881 0.10715 -1.972043
C  -5.974959 0.411886 -0.520072
C  -2.34655 -1.778622 -1.000232
C  -2.398001 -0.358623 0.795748
H  3.293677 2.18167 -0.660263
H  2.066809 0.344274 -1.534253
H  4.066243 1.052698 -2.61094
H  5.6691 0.789779 -1.930193
H  4.742888 -0.572911 -2.558155
H  4.986964 -1.76263 -0.26628
H  5.917383 -0.377512 0.297715
H  4.522143 -0.938086 1.211396
H  3.265503 0.763462 2.094022
H  -0.223062 -1.627418 1.575912
H  -0.207033 -2.799005 0.237594
H  4.422406 3.408123 3.82995
H  2.688188 3.650508 3.777285
H  3.337047 2.023795 3.976677
H  4.609699 4.591129 1.512638
H  3.699086 3.981132 0.14071
H  2.872296 4.797673 1.462434
H  -4.220477 -1.163157 -3.07407
H  -5.222133 -2.033128 -1.943723
H  -4.974549 0.737952 1.386819
H  -4.418886 1.79236 0.115853
H  -5.115356 0.981434 -2.41087
H  -6.506385 -0.07068 -2.560114
H  -6.467807 -0.461155 -0.082479
H  -6.698274 1.227619 -0.480324
totalener: -1094.85339260 hartree
nucrepener: 2055.70858188 hartree
electener: -3150.56197448 hartree
oneelecener: -5573.35843961 hartree
twoeener: 2422.79646513 hartree
kineticenergy: 1090.09405817 hartree
xcener: -105.972384701339 hartree
chargesum: 0.0000000
charge: -0.265823 -0.396385 -0.316353 -0.315091 -0.126628 0.094799 0.030632 -0.093504 -0.239083 -0.251292 -0.215270 0.360350 -0.055687 0.089307 -0.203394 -0.243992 -0.092827 -0.084889 -0.076195 -0.073654 -0.133974 -0.135381 0.264567 0.259412 0.083698 0.081743 0.069341 0.088307 0.089757 0.086590 0.083796 0.103768 0.107794 0.125329 0.119984 0.081137 0.082433 0.081925 0.086318 0.076341 0.087622 0.094620 0.092056 0.094473 0.093283 0.075252 0.079605 0.075017 0.080163
qa: -0.2658 -0.3964 -0.3164 -0.3151 -0.1266 0.0948 0.0306 -0.0935 -0.2391 -0.2513 -0.2153 0.3604 -0.0557 0.0893 -0.2034 -0.2440 -0.0928 -0.0849 -0.0762 -0.0737 -0.1340 -0.1354 0.2646 0.2594 0.0837 0.0817 0.0693 0.0883 0.0898 0.0866 0.0838 0.1038 0.1078 0.1253 0.1200 0.0811 0.0824 0.0819 0.0863 0.0763 0.0876 0.0946 0.0921 0.0945 0.0933 0.0753 0.0796 0.0750 0.0802
va: 2.1203 2.0913 2.1977 2.1978 3.1145 3.7295 3.8017 3.8902 3.9109 3.9168 3.9089 4.1457 3.8218 3.9001 3.9386 3.9457 3.6376 3.6189 3.9268 3.9264 3.8988 3.8967 4.2793 4.2785 1.0110 1.0288 1.0081 1.0042 1.0050 1.0027 1.0020 1.0200 1.0257 1.0127 1.0002 0.9975 0.9985 1.0132 0.9991 1.0165 0.9989 1.0190 1.0081 1.0190 1.0086 1.0088 1.0118 1.0088 1.0118
dispcorr: -0.021745430 hartree
energy: -1094.875138030258
dipole: 15.39393 -16.49052 -1.09658 18.29596 -17.43940 0.85656 -0.34467 -0.45701 -0.80168
magnitude: 1.60589 au
magnitude: 4.08184 debye
