program: Orca
programVersion: 5.0.2
elementType: O O O O N C C C C C C C C C C C C C C C C C C C H H H H H H H H H H H H H H H H H H H H H H H H H
charge: 0
multiplicity: 1
keywords: wb97x-d3
keywords: def2-TZVPP
keywords: def2/J RIJCOSX
keywords: DEFGRID2
keywords: scfconv7
keywords: smallprint printgap noloewdin
keywords: NOSOSCF
formula: C19H25NO4
InChI: InChI=1/C19H25NO4/c1-11(2)9-14-15(19(14,3)4)18(23)24-10-20-16(21)12-7-5-6-8-13(12)17(20)22/h9,14-15H,5-8,10H2,1-4H3
49 atoms
O  0.622757 -1.408853 0.340205
O  1.966209 -0.394974 1.819216
O  -1.630305 0.866448 1.425211
O  -2.248326 -3.362263 -0.132523
N  -1.628951 -1.371776 0.862747
C  3.998412 -0.209244 -0.52361
C  3.141018 0.999795 -0.735563
C  2.492606 -0.368721 -0.526084
C  4.699258 -0.773956 -1.737336
C  4.809011 -0.349017 0.740735
C  3.025736 2.093288 0.249965
C  1.709385 -0.692721 0.683858
C  3.273824 3.383022 0.009083
C  -0.334728 -1.721087 1.340452
C  3.093106 4.407478 1.089465
C  3.741728 3.942369 -1.300748
C  -3.413693 -0.121032 0.119315
C  -3.590561 -1.359227 -0.341231
C  -4.341563 1.015531 -0.105249
C  -4.736745 -1.802975 -1.173738
C  -5.674378 0.490538 -0.642687
C  -5.472857 -0.577455 -1.718866
C  -2.139173 -0.07436 0.884708
C  -2.446752 -2.202775 0.100132
H  3.066781 1.319509 -1.769509
H  2.077331 -0.808374 -1.425246
H  4.103264 -0.662881 -2.644315
H  5.65036 -0.264467 -1.902811
H  4.909283 -1.837212 -1.607893
H  4.995413 -1.401098 0.962786
H  5.776644 0.135583 0.59942
H  4.340807 0.095201 1.612832
H  2.707326 1.823919 1.249204
H  -0.125983 -1.182756 2.263305
H  -0.310049 -2.79404 1.52516
H  4.027421 4.936578 1.293421
H  2.36445 5.166272 0.791692
H  2.747778 3.962295 2.021299
H  3.90566 3.189556 -2.068291
H  3.024394 4.668436 -1.691577
H  4.683311 4.480535 -1.168543
H  -4.483086 1.579138 0.819499
H  -3.886507 1.717663 -0.811324
H  -4.389491 -2.448997 -1.982952
H  -5.407731 -2.420994 -0.568434
H  -6.252387 0.065792 0.183045
H  -6.26467 1.317815 -1.039363
H  -4.896983 -0.152397 -2.546037
H  -6.435567 -0.878733 -2.134166
totalener: -1094.85260717 hartree
nucrepener: 2072.06670795 hartree
electener: -3166.91931512 hartree
oneelecener: -5606.18428926 hartree
twoeener: 2439.26497414 hartree
kineticenergy: 1090.09328587 hartree
xcener: -105.972262681326 hartree
chargesum: -0.0000000
charge: -0.273409 -0.390907 -0.310114 -0.319290 -0.118340 0.117676 0.009121 -0.123677 -0.241303 -0.251540 -0.219666 0.375804 -0.035089 0.073413 -0.207780 -0.245003 -0.078225 -0.093929 -0.074094 -0.075775 -0.136503 -0.134145 0.250243 0.264864 0.084382 0.083919 0.070345 0.087759 0.089319 0.086935 0.082448 0.105515 0.116015 0.138671 0.112510 0.080409 0.081159 0.083985 0.076141 0.087631 0.084979 0.093996 0.094044 0.094947 0.091269 0.075465 0.080649 0.075691 0.079482
qa: -0.2734 -0.3909 -0.3101 -0.3193 -0.1183 0.1177 0.0091 -0.1237 -0.2413 -0.2515 -0.2197 0.3758 -0.0351 0.0734 -0.2078 -0.2450 -0.0782 -0.0939 -0.0741 -0.0758 -0.1365 -0.1341 0.2502 0.2649 0.0844 0.0839 0.0703 0.0878 0.0893 0.0869 0.0824 0.1055 0.1160 0.1387 0.1125 0.0804 0.0812 0.0840 0.0761 0.0876 0.0850 0.0940 0.0940 0.0949 0.0913 0.0755 0.0806 0.0757 0.0795
va: 2.1167 2.1003 2.2013 2.1945 3.0938 3.7178 3.8170 3.9255 3.9090 3.9198 3.9083 4.1256 3.7865 3.8920 3.9414 3.9472 3.6081 3.6416 3.9274 3.9243 3.8966 3.8982 4.2895 4.2838 1.0106 1.0294 1.0080 1.0042 1.0052 1.0028 1.0028 1.0193 1.0250 1.0167 1.0062 0.9981 0.9980 1.0127 1.0140 0.9984 0.9998 1.0189 1.0086 1.0191 1.0081 1.0086 1.0117 1.0088 1.0117
dispcorr: -0.022168451 hartree
energy: -1094.874775621504
dipole: 15.29618 -16.29244 -0.99626 17.98391 -17.57010 0.41382 -10.36351 9.25955 -1.10396
magnitude: 1.54354 au
magnitude: 3.92336 debye
