program: Orca
programVersion: 5.0.2
elementType: O O O O N C C C C C C C C C C C C C C C C C C C H H H H H H H H H H H H H H H H H H H H H H H H H
charge: 0
multiplicity: 1
keywords: wb97x-d3
keywords: def2-TZVPP
keywords: def2/J RIJCOSX
keywords: DEFGRID2
keywords: scfconv7
keywords: smallprint printgap noloewdin
keywords: NOSOSCF
formula: C19H25NO4
InChI: InChI=1/C19H25NO4/c1-11(2)9-14-15(19(14,3)4)18(23)24-10-20-16(21)12-7-5-6-8-13(12)17(20)22/h9,14-15H,5-8,10H2,1-4H3
49 atoms
O  0.362041 0.500633 0.314351
O  1.775508 2.13962 -0.228869
O  -2.382194 1.275534 2.198672
O  -2.016062 -0.679156 -1.894861
N  -1.91274 0.558406 0.053128
C  3.821273 0.598384 1.550424
C  3.986084 0.041245 0.179065
C  2.591502 0.125764 0.798511
C  4.229923 -0.280628 2.710274
C  4.056621 2.065099 1.814353
C  4.387762 0.874895 -0.980361
C  1.584801 1.050242 0.242256
C  4.086718 0.607484 -2.250522
C  -0.713716 1.283293 -0.182445
C  4.562124 1.487586 -3.365604
C  3.240152 -0.555581 -2.66837
C  -3.698921 -0.437032 1.110054
C  -3.589195 -1.012859 -0.08656
C  -4.741918 -0.75304 2.117411
C  -4.477887 -2.083554 -0.602739
C  -5.859945 -1.561883 1.456963
C  -5.306789 -2.65952 0.547686
C  -2.616214 0.572586 1.256343
C  -2.432348 -0.410939 -0.802964
H  4.353975 -0.981373 0.14254
H  2.173598 -0.81443 1.13912
H  5.288744 -0.146176 2.938912
H  3.660986 -0.032288 3.607857
H  4.070824 -1.338851 2.498662
H  3.496431 2.387273 2.693689
H  5.115538 2.232178 2.021915
H  3.768422 2.70791 0.988275
H  4.98827 1.753096 -0.767556
H  -0.603638 1.456931 -1.253112
H  -0.765201 2.242633 0.332532
H  5.166985 2.316942 -3.001698
H  5.159371 0.924963 -4.087489
H  3.716639 1.906518 -3.916609
H  2.911312 -1.168093 -1.83141
H  2.346443 -0.209561 -3.193628
H  3.779272 -1.201175 -3.366209
H  -4.290736 -1.314403 2.941761
H  -5.128965 0.16547 2.563835
H  -5.127488 -1.671772 -1.381699
H  -3.888206 -2.86202 -1.091931
H  -6.502869 -1.997411 2.223146
H  -6.490883 -0.88909 0.869136
H  -6.122392 -3.264278 0.149203
H  -4.680681 -3.334211 1.138284
totalener: -1094.85259980 hartree
nucrepener: 2077.19914544 hartree
electener: -3172.05174525 hartree
oneelecener: -5616.44789448 hartree
twoeener: 2444.39614923 hartree
kineticenergy: 1090.10134023 hartree
xcener: -105.972032778611 hartree
chargesum: -0.0000000
charge: -0.268479 -0.377871 -0.316144 -0.318843 -0.129057 0.130295 -0.059209 -0.086601 -0.241018 -0.283471 -0.171038 0.329669 -0.003914 0.094961 -0.210443 -0.254010 -0.088700 -0.090141 -0.074434 -0.073271 -0.135072 -0.135861 0.263041 0.263214 0.095295 0.080747 0.087085 0.092215 0.069527 0.088177 0.088117 0.107112 0.082470 0.122036 0.121358 0.077480 0.082137 0.087585 0.082575 0.094730 0.093228 0.093137 0.093439 0.092123 0.094765 0.080564 0.074738 0.080731 0.075025
qa: -0.2685 -0.3779 -0.3161 -0.3188 -0.1291 0.1303 -0.0592 -0.0866 -0.2410 -0.2835 -0.1710 0.3297 -0.0039 0.0950 -0.2104 -0.2540 -0.0887 -0.0901 -0.0744 -0.0733 -0.1351 -0.1359 0.2630 0.2632 0.0953 0.0807 0.0871 0.0922 0.0695 0.0882 0.0881 0.1071 0.0825 0.1220 0.1214 0.0775 0.0821 0.0876 0.0826 0.0947 0.0932 0.0931 0.0934 0.0921 0.0948 0.0806 0.0747 0.0807 0.0750
va: 2.1036 2.1040 2.1988 2.1959 3.1196 3.7424 3.8981 3.8320 3.9031 3.9110 3.8868 4.1550 3.7621 3.9082 3.9422 3.9459 3.6198 3.6281 3.9278 3.9255 3.8968 3.8997 4.2776 4.2760 1.0051 1.0300 1.0049 1.0047 1.0076 1.0047 0.9974 1.0179 1.0113 1.0024 1.0043 1.0111 0.9983 0.9995 1.0091 1.0005 1.0009 1.0085 1.0191 1.0083 1.0188 1.0116 1.0089 1.0115 1.0089
dispcorr: -0.022911343 hartree
energy: -1094.875511146418
dipole: 15.98247 -16.93960 -0.95713 -5.99893 4.78925 -1.20968 -0.86959 1.23260 0.36301
magnitude: 1.58467 au
magnitude: 4.02792 debye
