program: Gaussian 09
title: 000071259
version: EM64L-G09RevD.01
frameworkgroup: C1[X(C16H17N9O5S2)]
method: RPBEPBE
basis: SDD
operation: Freq
keyword: #p
keyword: freq=noraman
keyword: PBEPBE/SDD
title: #p freq=noraman PBEPBE/SDD
converged: YES YES NO NO
title: Mulliken charges:
elementType: S S O O O O O N N N N N N N N N C C C C C C C C C C C C C C C C H H H H H H H H H H H H H H H H H
charge: 0.229475 0.239505 -0.143076 -0.435234 -0.196369 -0.289655 -0.201154 -0.179022 -0.370036 -0.114921 -0.064356 -0.033123 -0.061210 -0.147472 -0.005037 -0.566112 -0.481877 -0.184525 0.110408 0.175670 0.420609 -0.828252 -0.527425 0.116382 0.227722 -0.050223 0.345029 0.125716 -0.666865 -0.712055 -0.208180 -0.495447 0.328859 0.309034 0.295975 0.293464 0.353234 0.263809 0.299436 0.394592 0.325919 0.254650 0.246386 0.243792 0.232629 0.230777 0.231292 0.329774 0.337488
chargesum: 0.00000
title: Mulliken charges with hydrogens summed into heavy atoms:
elementType: S S O O O O O N N N N N N N N N C C C C C C C C C C C C C C C C
charge: 0.229475 0.239505 -0.143076 -0.040642 -0.196369 -0.289655 -0.201154 -0.179022 -0.016801 -0.114921 -0.064356 -0.033123 -0.061210 -0.147472 -0.005037 0.101150 -0.153019 0.124509 0.110408 0.175670 0.420609 -0.238813 0.035820 0.116382 0.227722 -0.050223 0.345029 0.125716 -0.340946 0.032773 -0.208180 0.199251
polarizability: 4.09284832e+02 8.11518332e-01 2.42704831e+02 -2.25685363e+01 -1.04264348e+01 2.81257021e+02
1716.lowfreq: -35.0340 -7.0540 -3.1364 -1.9807 0.0008 0.0015 0.0020 1.7660 9.9102
frequency: -35.0217 -4.3458 9.8653 11.6061 16.9216 24.6936 29.8391 40.7990 55.4482 61.0650 69.2149 83.1117 86.2165 103.4227 114.0026 124.9066 128.5867 142.6432 159.9010 171.4082 185.5082 194.3857 211.5246 223.6212 244.0192 247.6156 269.7771 277.1603 280.3388 289.8555 305.1770 312.3536 326.9759 340.9012 362.2621 386.9423 398.6152 408.7039 414.2285 419.7853 430.4084 490.8533 491.9558 517.1244 537.1900 552.4272 558.1289 568.2471 574.9261 618.4916 626.3727 630.3828 643.8497 659.6569 665.6325 669.5839 696.7185 712.3292 726.9474 737.1097 739.5724 750.1040 762.3791 786.4083 790.9491 799.2070 811.4302 849.9314 877.6190 884.8378 890.1062 905.7926 939.9225 948.3400 958.3367 971.0888 972.0995 997.0624 1007.5334 1012.7997 1045.6095 1053.1588 1086.3267 1095.7013 1100.5634 1104.7685 1114.3070 1134.0506 1148.9558 1152.5756 1179.6685 1187.6700 1205.0450 1209.9997 1228.8269 1247.0820 1250.5661 1260.2416 1264.3762 1292.1060 1301.0922 1309.2958 1321.8481 1333.5652 1345.2572 1389.9005 1401.4047 1414.1182 1422.4145 1433.8259 1449.6639 1449.9825 1462.6197 1466.1857 1469.7872 1471.7571 1472.3614 1533.8716 1587.4992 1599.7264 1620.4485 1638.1261 1650.2023 1738.3471 2989.6311 3003.9973 3005.2162 3030.2282 3041.8772 3071.3675 3079.5867 3088.7606 3095.6183 3125.4252 3132.0059 3133.2239 3258.8543 3467.7127 3511.9185 3560.4664 3711.9010
redmass: 1.0208 5.4944 7.3842 5.7009 6.7130 8.6764 6.1147 10.6727 9.1615 7.5988 9.0555 3.2023 3.4742 5.5273 5.4982 2.7773 3.4071 6.5629 4.7720 3.5503 6.5634 6.7486 5.5319 5.6183 5.8395 4.5471 7.7073 8.7684 5.3235 1.1307 3.8136 6.0447 4.7054 5.1036 5.2054 5.4009 2.9152 9.0139 1.2536 4.7152 8.7494 6.3065 5.9194 5.3031 6.4491 3.1296 4.9996 4.8732 6.1449 5.6447 2.0071 4.5955 3.8711 7.3400 8.3139 5.4319 6.0852 6.2579 6.3592 1.5220 4.3741 2.8887 4.1114 4.7954 6.6226 2.0064 4.3732 1.9747 3.7623 5.1531 5.7796 5.0380 5.2352 4.9564 4.9085 4.5604 2.1880 4.9623 6.8636 4.9867 3.2918 1.5289 3.5494 2.3740 1.8400 1.2503 1.8015 5.5543 1.4833 1.8698 1.3040 1.7480 2.4120 1.9866 1.5927 1.5360 2.1228 3.5952 1.5210 3.0069 3.4403 1.7520 2.2214 4.1937 1.7435 3.5931 1.2075 1.2459 1.0937 5.5077 1.1143 1.0528 1.0641 1.1210 2.7114 1.3626 2.0986 9.8456 1.5273 8.4422 8.1167 3.0870 9.1354 12.8285 1.0290 1.0605 1.0376 1.0657 1.0834 1.1007 1.0897 1.0982 1.1057 1.0992 1.0963 1.1031 1.0958 1.0775 1.0640 1.0451 1.1047
irintensity: 0.1024 0.4639 0.1545 1.0731 0.5700 0.7006 1.3994 3.4239 4.4880 1.6867 0.9409 2.1682 0.4169 1.3580 5.7935 0.2187 0.9093 2.0575 0.8043 0.2260 2.1990 1.4121 4.9811 3.5902 2.9622 1.9719 15.6461 2.1513 8.4707 80.6146 4.8701 1.5151 8.2292 9.0255 10.3102 61.0654 0.6521 7.0591 246.7530 4.4390 8.0237 2.6691 10.1830 3.2966 1.9193 69.4532 4.6651 3.7490 12.7840 7.8624 88.3466 6.8401 49.7143 0.4430 0.8907 8.8889 0.0885 5.1369 18.2907 24.7886 43.0254 5.3472 50.6866 17.4477 4.0691 72.7694 98.6739 1.6525 32.2457 73.2387 22.4641 17.9812 21.1779 36.3341 99.8734 53.1163 29.8320 42.5049 156.4475 51.3153 48.1077 13.6008 52.6837 259.9882 21.4316 0.2293 69.2550 27.5734 6.8362 28.7548 20.8694 12.6138 15.8874 14.1739 4.4313 28.9812 15.8422 80.7483 11.9009 255.8917 42.0926 9.9901 1.0808 98.7411 9.8144 73.4814 9.8679 7.6614 17.8123 11.1734 20.1390 14.2452 21.2431 159.4998 144.0233 241.7879 396.1306 3.6516 13.0178 147.0601 107.1731 517.8027 180.8730 494.3176 75.6717 19.6350 11.0809 1.6453 50.2275 0.4188 10.5154 10.9772 34.0550 5.6178 7.5606 16.6220 38.4504 60.6675 53.2281 118.2433 49.6156
temp: 298.150 k
press: 1.00000 atm
elementType: 16 16 8 8 8 8 8 7 7 7 7 7 7 7 7 7 6 6 6 6 6 6 6 6 6 6 6 6 6 6 6 6 1 1 1 1 1 1 1 1 1 1 1 1 1 1 1 1 1
symmnumber: 1
zpe: 898694.3 jmol-1
zpe.correction: 0.342295 hartree
zpe.thermalcorrener: 0.372606 hartree
zpe.thermalcorrenthalpy: 0.373550 hartree
zpe.thermalcorrgfe: 0.275542 hartree
zpe.sumelectzpe: -2282.447577 hartree
zpe.sumelectthermal: -2282.417266 hartree
zpe.sumelectthermalent: -2282.416322 hartree
zpe.sumelectthermalfe: -2282.514329 hartree
dipole: 1.1472 -1.9368 2.3874
dipole: 3.2814
quadrupole: -140.4806 -214.7164 -189.9427
quadrupole: -24.3238 22.3838 14.1291
quadrupole: 41.2327 -33.0032 -8.2295 -24.3238 22.3838 14.1291
hfenergy: -2282.7898714 hartree
pointgroup: C01 [X(C16H17N9O5S2)]
dipole: 0.5358399 0.441349 -1.0884568 debye
polarizability: 395.8427547|30.9637179|246.7614179|35.2185437|12.4235251|290.6425116 unknown
InChI: InChI=1S/C16H17N9O5S2/c1-6-20-23-24(21-6)3-7-4-31-14-10(13(27)25(14)11(7)15(28)29)19-12(26)9(22-30-2)8-5-32-16(17)18-8/h5,10,14,19,28H,3-4,17H2,1-2H3
charge 0 multiplicity 1
49 atoms
S  -0.674703 0.687283 -0.91286
S  7.07914 2.487476 2.556169
O  0.283631 -3.056517 1.375329
O  -3.649723 -3.791321 -0.052745
O  -2.803211 -3.377286 2.07051
O  2.831897 0.878837 2.548267
O  5.065555 -0.101395 -1.583871
N  -1.310004 -1.242312 0.970267
N  1.846913 -0.242901 0.76811
N  -5.345209 -0.233388 -1.409812
N  -6.054368 0.227407 -0.328085
N  -5.605444 0.463979 -2.58949
N  3.970269 -0.093646 -0.673933
N  -6.522911 1.402277 -2.245538
N  6.457118 1.462342 0.147289
N  8.623292 2.474713 0.198346
C  -0.737455 0.115787 0.891744
C  0.614085 -0.463297 1.467373
C  -0.065494 -1.871697 1.314299
C  -2.48336 -1.698837 0.33418
C  -3.087241 -0.939603 -0.644943
C  -2.542424 0.401633 -1.117305
C  -4.380116 -1.345929 -1.340383
C  -2.974318 -3.001478 0.893072
C  2.91298 0.412488 1.37005
C  4.161296 0.515011 0.496158
C  5.351806 1.217387 0.997606
C  -6.783899 1.2483 -0.879806
C  5.494444 1.68806 2.306063
C  -7.755366 2.096763 -0.124816
C  7.428703 2.098978 0.765091
C  4.644004 -0.839423 -2.796821
H  -1.265948 0.870635 1.492377
H  0.76348 -0.167851 2.521236
H  -2.73769 0.529107 -2.196548
H  -3.055021 1.231203 -0.595858
H  2.012038 -0.59937 -0.180803
H  -4.174973 -1.619741 -2.3912
H  -4.860181 -2.204112 -0.853494
H  -3.928255 -4.64029 0.387598
H  4.768463 1.620515 3.11098
H  -8.168102 2.862779 -0.79908
H  -8.587693 1.490936 0.27381
H  -7.268986 2.597457 0.729982
H  4.376939 -1.879938 -2.543243
H  5.530022 -0.814631 -3.449707
H  3.790783 -0.332776 -3.28016
H  9.336952 2.968485 0.724473
H  8.783086 2.2411 -0.778977
