program: Orca
programVersion: 5.0.2
elementType: O O O O N C C C C C C C C C C C C C C C C C C C H H H H H H H H H H H H H H H H H H H H H H H H H
charge: 0
multiplicity: 1
keywords: wb97x-d3
keywords: def2-TZVPP
keywords: def2/J RIJCOSX
keywords: DEFGRID2
keywords: scfconv7
keywords: smallprint printgap noloewdin
keywords: NOSOSCF
formula: C19H25NO4
InChI: InChI=1/C19H25NO4/c1-11(2)9-14-15(19(14,3)4)18(23)24-10-20-16(21)12-7-5-6-8-13(12)17(20)22/h9,14-15H,5-8,10H2,1-4H3
49 atoms
O  0.637689 -1.454192 0.346748
O  1.954175 -0.253197 1.709058
O  -1.437068 0.957969 0.940149
O  -2.403353 -3.447714 0.349432
N  -1.609489 -1.342383 0.875371
C  3.901657 -0.043203 -0.681714
C  2.908629 1.045903 -0.935973
C  2.421929 -0.366012 -0.641344
C  4.638472 -0.597814 -1.87878
C  4.737315 -0.034012 0.574218
C  2.661477 2.172138 0.001617
C  1.691729 -0.653733 0.60907
C  3.487467 3.205553 0.165459
C  -0.314217 -1.671252 1.372483
C  3.147665 4.33321 1.092169
C  4.799705 3.340784 -0.545702
C  -3.365126 -0.151177 -0.017475
C  -3.644263 -1.442394 -0.194098
C  -4.232643 0.975295 -0.443619
C  -4.878384 -1.971479 -0.826121
C  -5.292497 0.45983 -1.418941
C  -5.916384 -0.852584 -0.941357
C  -2.040579 -0.03741 0.650621
C  -2.519808 -2.254009 0.346147
H  2.779319 1.310126 -1.983509
H  2.037753 -0.90893 -1.496878
H  5.530811 -0.004436 -2.089611
H  4.960209 -1.625092 -1.698889
H  4.021463 -0.595701 -2.778516
H  5.675869 0.487687 0.376841
H  4.251638 0.457876 1.410355
H  4.986373 -1.052548 0.877045
H  1.725446 2.167791 0.549812
H  -0.086071 -1.067069 2.248982
H  -0.311564 -2.7262 1.642856
H  2.191039 4.178981 1.589207
H  3.912343 4.448943 1.864471
H  3.100626 5.284342 0.555531
H  5.009032 2.508897 -1.215592
H  4.825574 4.260016 -1.136746
H  5.623219 3.410249 0.169345
H  -4.701831 1.425722 0.437199
H  -3.631191 1.767286 -0.895175
H  -4.632662 -2.377467 -1.812836
H  -5.26856 -2.814096 -0.250873
H  -6.067711 1.215022 -1.556281
H  -4.83184 0.305374 -2.398949
H  -6.713827 -1.157946 -1.620327
H  -6.384174 -0.694911 0.034788
totalener: -1094.85104570 hartree
nucrepener: 2088.52459596 hartree
electener: -3183.37564166 hartree
oneelecener: -5639.20774645 hartree
twoeener: 2455.83210480 hartree
kineticenergy: 1090.09295005 hartree
xcener: -105.971481210674 hartree
chargesum: 0.0000000
charge: -0.277197 -0.371848 -0.322719 -0.320528 -0.112221 0.072075 -0.042429 -0.066603 -0.239631 -0.261975 -0.171329 0.335994 -0.024909 0.067048 -0.210211 -0.256527 -0.065282 -0.104002 -0.075571 -0.073376 -0.134897 -0.135722 0.252225 0.269895 0.098087 0.082809 0.081857 0.093576 0.072153 0.076976 0.116997 0.093664 0.099952 0.138927 0.113382 0.085029 0.082517 0.081541 0.078737 0.095614 0.092023 0.091893 0.095568 0.093841 0.093983 0.079775 0.075795 0.079777 0.075265
qa: -0.2772 -0.3718 -0.3227 -0.3205 -0.1122 0.0721 -0.0424 -0.0666 -0.2396 -0.2620 -0.1713 0.3360 -0.0249 0.0670 -0.2102 -0.2565 -0.0653 -0.1040 -0.0756 -0.0734 -0.1349 -0.1357 0.2522 0.2699 0.0981 0.0828 0.0819 0.0936 0.0722 0.0770 0.1170 0.0937 0.1000 0.1389 0.1134 0.0850 0.0825 0.0815 0.0787 0.0956 0.0920 0.0919 0.0956 0.0938 0.0940 0.0798 0.0758 0.0798 0.0753
va: 2.1054 2.1206 2.1863 2.1943 3.0862 3.7229 3.8813 3.8409 3.9031 3.9037 3.8905 4.1649 3.7417 3.8915 3.9389 3.9384 3.6099 3.6596 3.9250 3.9236 3.8983 3.8978 4.2755 4.2771 1.0044 1.0306 1.0067 1.0047 1.0079 0.9996 1.0164 1.0057 1.0253 1.0150 1.0115 1.0118 0.9990 0.9975 1.0087 1.0037 0.9979 1.0081 1.0192 1.0085 1.0193 1.0117 1.0087 1.0117 1.0086
dispcorr: -0.023701863 hartree
energy: -1094.874747561189
dipole: 16.72228 -17.72783 -1.00554 17.15461 -16.78058 0.37403 -9.40283 8.37889 -1.02394
magnitude: 1.48306 au
magnitude: 3.76963 debye
