program: Orca
programVersion: 5.0.2
elementType: O O O O N C C C C C C C C C C C C C C C C C C C H H H H H H H H H H H H H H H H H H H H H H H H H
charge: 0
multiplicity: 1
keywords: wb97x-d3
keywords: def2-TZVPP
keywords: def2/J RIJCOSX
keywords: DEFGRID2
keywords: scfconv7
keywords: smallprint printgap noloewdin
keywords: NOSOSCF
formula: C19H25NO4
InChI: InChI=1/C19H25NO4/c1-11(2)9-14-15(19(14,3)4)18(23)24-10-20-16(21)12-7-5-6-8-13(12)17(20)22/h9,14-15H,5-8,10H2,1-4H3
49 atoms
O  0.296868 -0.351176 0.009371
O  2.139951 -1.08307 1.022558
O  -1.687582 -2.548729 -1.685054
O  -2.597538 0.191703 1.830991
N  -1.791089 -1.267789 0.233068
C  3.619013 0.650842 -1.126081
C  3.433505 1.585032 0.029353
C  2.245376 0.783583 -0.497771
C  3.758132 1.272483 -2.496294
C  4.437766 -0.605695 -0.967882
C  4.028554 1.357508 1.359979
C  1.609744 -0.307197 0.269245
C  4.733659 2.249555 2.061334
C  -0.442584 -1.376165 0.662188
C  5.280792 1.895538 3.412631
C  5.058025 3.643312 1.615026
C  -3.68784 -1.332279 -1.068953
C  -3.955254 -0.532803 -0.036582
C  -4.637075 -1.660641 -2.161987
C  -5.253423 0.145176 0.205534
C  -5.817519 -0.687844 -2.120797
C  -6.326452 -0.469808 -0.695367
C  -2.288519 -1.822069 -0.944785
C  -2.74556 -0.442068 0.824473
H  3.360516 2.629108 -0.254764
H  1.532586 1.361263 -1.074528
H  3.170679 2.186569 -2.593284
H  4.800532 1.5264 -2.697436
H  3.427617 0.581807 -3.274242
H  4.129163 -1.356219 -1.697641
H  5.488195 -0.375833 -1.154501
H  4.367656 -1.055826 0.017099
H  3.87745 0.381397 1.80275
H  -0.398063 -1.254678 1.744505
H  -0.05586 -2.359535 0.394576
H  4.898035 2.572482 4.180831
H  5.023476 0.878781 3.706106
H  6.369942 1.986954 3.433915
H  4.667925 4.377524 2.323808
H  6.140169 3.790315 1.583544
H  4.669247 3.894156 0.63121
H  -4.129192 -1.625279 -3.128305
H  -4.980598 -2.693717 -2.045991
H  -5.530951 0.069191 1.259253
H  -5.144666 1.216164 0.005759
H  -5.506692 0.271796 -2.543889
H  -6.624026 -1.058567 -2.755003
H  -6.641648 -1.42915 -0.274587
H  -7.21098 0.16869 -0.705637
totalener: -1094.85435239 hartree
nucrepener: 2036.77570395 hartree
electener: -3131.63005634 hartree
oneelecener: -5535.42891566 hartree
twoeener: 2403.79885932 hartree
kineticenergy: 1090.09143504 hartree
xcener: -105.971872639012 hartree
chargesum: -0.0000000
charge: -0.265397 -0.400412 -0.316604 -0.315561 -0.128791 0.096729 0.025357 -0.086546 -0.240970 -0.254336 -0.220480 0.351541 -0.045570 0.094119 -0.206580 -0.242494 -0.088038 -0.089753 -0.074252 -0.076480 -0.136124 -0.133442 0.261685 0.263042 0.086198 0.079157 0.069989 0.088081 0.090258 0.089052 0.084971 0.102628 0.113569 0.123645 0.122604 0.082228 0.081592 0.081145 0.087446 0.085349 0.075718 0.094312 0.092702 0.094489 0.093410 0.075766 0.080123 0.075103 0.079823
qa: -0.2654 -0.4004 -0.3166 -0.3156 -0.1288 0.0967 0.0254 -0.0865 -0.2410 -0.2543 -0.2205 0.3515 -0.0456 0.0941 -0.2066 -0.2425 -0.0880 -0.0898 -0.0743 -0.0765 -0.1361 -0.1334 0.2617 0.2630 0.0862 0.0792 0.0700 0.0881 0.0903 0.0891 0.0850 0.1026 0.1136 0.1236 0.1226 0.0822 0.0816 0.0811 0.0874 0.0853 0.0757 0.0943 0.0927 0.0945 0.0934 0.0758 0.0801 0.0751 0.0798
va: 2.1211 2.0857 2.1983 2.1989 3.1188 3.7341 3.7953 3.9201 3.9117 3.9226 3.8997 4.1427 3.8035 3.9033 3.9404 3.9471 3.6228 3.6244 3.9261 3.9287 3.8995 3.8964 4.2769 4.2761 1.0111 1.0294 1.0083 1.0039 1.0050 1.0022 1.0023 1.0188 1.0259 1.0036 1.0031 0.9981 1.0127 0.9981 0.9988 0.9995 1.0162 1.0192 1.0080 1.0188 1.0086 1.0088 1.0117 1.0086 1.0118
dispcorr: -0.021676144 hartree
energy: -1094.876028538009
dipole: 18.31499 -19.48017 -1.16517 14.52251 -13.87262 0.64990 -2.82195 2.00180 -0.82015
magnitude: 1.56609 au
magnitude: 3.98069 debye
