program: Orca
programVersion: 5.0.2
elementType: O O O O N C C C C C C C C C C C C C C C C C C C H H H H H H H H H H H H H H H H H H H H H H H H H
charge: 0
multiplicity: 1
keywords: wb97x-d3
keywords: def2-TZVPP
keywords: def2/J RIJCOSX
keywords: DEFGRID2
keywords: scfconv7
keywords: smallprint printgap noloewdin
keywords: NOSOSCF
formula: C19H25NO4
InChI: InChI=1/C19H25NO4/c1-11(2)9-14-15(19(14,3)4)18(23)24-10-20-16(21)12-7-5-6-8-13(12)17(20)22/h9,14-15H,5-8,10H2,1-4H3
49 atoms
O  0.480338 -0.181847 0.025513
O  2.249468 -0.815457 1.229281
O  -1.533818 -2.705069 -1.129084
O  -2.489589 0.942781 1.419875
N  -1.666847 -0.92553 0.338313
C  3.916013 0.290304 -1.165412
C  3.769468 1.422019 -0.20815
C  2.531751 0.644546 -0.655901
C  4.164808 0.636331 -2.615416
C  4.596853 -0.988622 -0.744062
C  4.282563 1.363088 1.182677
C  1.793274 -0.196552 0.305178
C  3.785451 2.053497 2.208082
C  -0.351592 -0.960517 0.874091
C  4.385934 1.960506 3.577144
C  2.589748 2.94794 2.09393
C  -3.499193 -1.300305 -1.003496
C  -3.780604 -0.234356 -0.254869
C  -4.407515 -1.898448 -2.013672
C  -5.059075 0.518698 -0.289037
C  -5.547053 -0.923109 -2.316066
C  -6.11325 -0.296403 -1.041391
C  -2.132216 -1.77717 -0.662107
C  -2.612322 0.058843 0.619067
H  3.813697 2.410287 -0.659679
H  1.892794 1.151205 -1.369959
H  3.79612 -0.151606 -3.27438
H  3.674658 1.567005 -2.904364
H  5.233647 0.754646 -2.802577
H  4.252113 -1.82131 -1.359397
H  5.674251 -0.895387 -0.895225
H  4.422721 -1.25387 0.294491
H  5.138059 0.720108 1.361317
H  -0.364631 -0.547984 1.883255
H  -0.006694 -1.993695 0.913753
H  5.251317 1.299621 3.601088
H  4.701095 2.942406 3.939209
H  3.655296 1.581519 4.295906
H  1.808364 2.633616 2.789704
H  2.844481 3.977067 2.35892
H  2.156611 2.957023 1.096029
H  -3.852751 -2.1512 -2.919966
H  -4.799275 -2.847293 -1.633017
H  -5.390085 0.750636 0.725688
H  -4.895936 1.486325 -0.774516
H  -5.176598 -0.13181 -2.974177
H  -6.337584 -1.437052 -2.864655
H  -6.488823 -1.088407 -0.387008
H  -6.96798 0.337263 -1.281951
totalener: -1094.85250669 hartree
nucrepener: 2074.69946076 hartree
electener: -3169.55196745 hartree
oneelecener: -5611.45433277 hartree
twoeener: 2441.90236532 hartree
kineticenergy: 1090.09811901 hartree
xcener: -105.971527870884 hartree
chargesum: 0.0000000
charge: -0.268345 -0.378439 -0.316312 -0.318439 -0.126133 0.129617 -0.059230 -0.084893 -0.241659 -0.284251 -0.170889 0.327340 -0.001941 0.093564 -0.210520 -0.254771 -0.087201 -0.093251 -0.074070 -0.074116 -0.135571 -0.135350 0.260285 0.265846 0.096805 0.082195 0.091980 0.070010 0.087016 0.088493 0.088270 0.107320 0.082102 0.122493 0.120863 0.077128 0.082024 0.087812 0.092574 0.094049 0.082769 0.094583 0.092231 0.093825 0.093254 0.075695 0.079823 0.075337 0.080078
qa: -0.2683 -0.3784 -0.3163 -0.3184 -0.1261 0.1296 -0.0592 -0.0849 -0.2417 -0.2843 -0.1709 0.3273 -0.0019 0.0936 -0.2105 -0.2548 -0.0872 -0.0933 -0.0741 -0.0741 -0.1356 -0.1354 0.2603 0.2658 0.0968 0.0822 0.0920 0.0700 0.0870 0.0885 0.0883 0.1073 0.0821 0.1225 0.1209 0.0771 0.0820 0.0878 0.0926 0.0940 0.0828 0.0946 0.0922 0.0938 0.0933 0.0757 0.0798 0.0753 0.0801
va: 2.1050 2.1019 2.1985 2.1968 3.1172 3.7416 3.8999 3.8271 3.9037 3.9113 3.8909 4.1561 3.7584 3.9065 3.9423 3.9462 3.6223 3.6286 3.9262 3.9265 3.8991 3.8980 4.2781 4.2751 1.0045 1.0296 1.0048 1.0076 1.0047 1.0047 0.9975 1.0178 1.0114 1.0022 1.0054 1.0113 0.9979 0.9995 1.0008 1.0006 1.0092 1.0191 1.0082 1.0190 1.0084 1.0087 1.0117 1.0089 1.0117
dispcorr: -0.022875126 hartree
energy: -1094.875381812832
dipole: 13.28895 -14.50782 -1.21887 10.05948 -9.61707 0.44241 -2.73097 1.85508 -0.87589
magnitude: 1.56479 au
magnitude: 3.97737 debye
