program: Orca
programVersion: 5.0.2
elementType: O O O O N C C C C C C C C C C C C C C C C C C C H H H H H H H H H H H H H H H H H H H H H H H H H
charge: 0
multiplicity: 1
keywords: wb97x-d3
keywords: def2-TZVPP
keywords: def2/J RIJCOSX
keywords: DEFGRID2
keywords: scfconv7
keywords: smallprint printgap noloewdin
keywords: NOSOSCF
formula: C19H25NO4
InChI: InChI=1/C19H25NO4/c1-11(2)9-14-15(19(14,3)4)18(23)24-10-20-16(21)12-7-5-6-8-13(12)17(20)22/h9,14-15H,5-8,10H2,1-4H3
49 atoms
O  1.299207 -1.4897 -0.149724
O  2.338366 -2.079591 -2.045962
O  -0.996357 -0.516994 -2.384589
O  -1.514766 -1.91193 1.911971
N  -1.008176 -1.526275 -0.307231
C  3.945357 -0.083731 0.547844
C  2.95457 0.926546 0.06646
C  3.245527 -0.313358 -0.776306
C  5.407971 0.281832 0.438203
C  3.653663 -0.941026 1.755187
C  1.679157 1.19488 0.770214
C  2.268828 -1.382113 -1.072266
C  0.756994 2.076418 0.379974
C  0.177037 -2.307769 -0.426815
C  -0.4252 2.392275 1.246485
C  0.813327 2.827615 -0.914667
C  -2.600788 0.093459 -0.679374
C  -2.749388 -0.310999 0.581308
C  -3.439258 1.117629 -1.350073
C  -3.764094 0.208331 1.531652
C  -4.701636 1.366185 -0.522611
C  -4.391085 1.486689 0.969647
C  -1.457017 -0.639569 -1.284774
C  -1.716151 -1.340305 0.87655
H  3.400914 1.815955 -0.368557
H  3.868695 -0.139229 -1.645852
H  5.606656 0.910375 -0.430795
H  5.734458 0.830587 1.323533
H  6.030037 -0.610522 0.349789
H  2.609337 -1.218891 1.862271
H  4.234706 -1.863753 1.712264
H  3.950465 -0.410119 2.661814
H  1.518401 0.681446 1.711671
H  0.138192 -3.107257 0.311235
H  0.241195 -2.731352 -1.427405
H  -0.483217 1.740543 2.118186
H  -0.378386 3.424601 1.604276
H  -1.362268 2.298444 0.693117
H  0.814898 3.907838 -0.747887
H  1.682164 2.577162 -1.519255
H  -0.068969 2.605181 -1.520893
H  -2.859959 2.041027 -1.462028
H  -3.687585 0.802306 -2.365766
H  -4.528126 -0.557154 1.701658
H  -3.307673 0.390905 2.507431
H  -5.20277 2.268911 -0.874956
H  -5.401838 0.540961 -0.680778
H  -5.2996 1.726874 1.523869
H  -3.704418 2.323489 1.128194
totalener: -1094.84747944 hartree
nucrepener: 2230.23384549 hartree
electener: -3325.08132493 hartree
oneelecener: -5922.07750768 hartree
twoeener: 2596.99618275 hartree
kineticenergy: 1090.10757696 hartree
xcener: -105.977086962851 hartree
chargesum: 0.0000000
charge: -0.269533 -0.352556 -0.306551 -0.322088 -0.091428 0.124451 -0.030550 -0.113216 -0.240560 -0.283566 -0.159138 0.359711 -0.047342 0.049723 -0.209556 -0.244164 -0.078022 -0.095908 -0.069382 -0.074002 -0.121310 -0.156666 0.219028 0.258682 0.087701 0.085381 0.071663 0.086682 0.092323 0.092726 0.094340 0.093375 0.092713 0.112409 0.145173 0.088058 0.108396 0.033459 0.092365 0.085654 0.081328 0.088056 0.100747 0.098685 0.097905 0.080367 0.076761 0.084958 0.082713
qa: -0.2695 -0.3526 -0.3066 -0.3221 -0.0914 0.1245 -0.0305 -0.1132 -0.2406 -0.2836 -0.1591 0.3597 -0.0473 0.0497 -0.2096 -0.2442 -0.0780 -0.0959 -0.0694 -0.0740 -0.1213 -0.1567 0.2190 0.2587 0.0877 0.0854 0.0717 0.0867 0.0923 0.0927 0.0943 0.0934 0.0927 0.1124 0.1452 0.0881 0.1084 0.0335 0.0924 0.0857 0.0813 0.0881 0.1007 0.0987 0.0979 0.0804 0.0768 0.0850 0.0827
va: 2.0817 2.1609 2.1976 2.1894 3.0907 3.7785 3.7869 3.8590 3.9023 3.9154 3.8709 4.2111 3.7337 3.8900 3.9454 3.9584 3.5496 3.5975 3.9168 3.9069 3.8889 3.8967 4.2711 4.2613 1.0060 1.0284 1.0087 1.0041 1.0043 1.0167 1.0028 0.9996 1.0128 1.0097 1.0194 1.0096 1.0015 1.0015 0.9976 1.0114 1.0066 1.0089 1.0207 1.0088 1.0178 1.0130 1.0096 1.0137 1.0056
dispcorr: -0.028917188 hartree
energy: -1094.876396626201
dipole: 3.09849 -4.08567 -0.98719 20.10756 -18.81970 1.28786 8.54884 -7.76467 0.78417
magnitude: 1.80223 au
magnitude: 4.58090 debye
