program: Orca
programVersion: 5.0.2
elementType: O O O O N C C C C C C C C C C C C C C C C C C C H H H H H H H H H H H H H H H H H H H H H H H H H
charge: 0
multiplicity: 1
keywords: wb97x-d3
keywords: def2-TZVPP
keywords: def2/J RIJCOSX
keywords: DEFGRID2
keywords: scfconv7
keywords: smallprint printgap noloewdin
keywords: NOSOSCF
formula: C19H25NO4
InChI: InChI=1/C19H25NO4/c1-11(2)9-14-15(19(14,3)4)18(23)24-10-20-16(21)12-7-5-6-8-13(12)17(20)22/h9,14-15H,5-8,10H2,1-4H3
49 atoms
O  1.179216 -1.037142 -0.503942
O  2.695925 -2.134621 -1.710283
O  -1.456692 0.259913 -2.351478
O  -1.249466 -2.295395 1.405837
N  -1.08615 -1.259007 -0.651154
C  3.54987 -0.193221 1.258986
C  3.217887 0.938739 0.346124
C  3.45067 -0.45116 -0.234461
C  4.950234 -0.250379 1.824936
C  2.514839 -0.729603 2.218169
C  1.908562 1.639416 0.386071
C  2.42967 -1.29391 -0.891424
C  1.31037 2.225898 -0.650223
C  0.146484 -1.813084 -1.090973
C  0.0433 3.008966 -0.479381
C  1.832549 2.155774 -2.051228
C  -2.818203 0.227738 -0.350916
C  -2.769073 -0.532991 0.742586
C  -3.794893 1.320672 -0.585403
C  -3.699134 -0.435247 1.89501
C  -4.494857 1.669437 0.729899
C  -4.907779 0.418499 1.506066
C  -1.733766 -0.196929 -1.276767
C  -1.63521 -1.486135 0.609773
H  4.052466 1.603004 0.131236
H  4.40678 -0.586601 -0.726875
H  5.69012 0.144418 1.12757
H  5.016562 0.336444 2.743129
H  5.234336 -1.276407 2.064533
H  2.581487 -0.189571 3.16483
H  1.493421 -0.64315 1.861065
H  2.700701 -1.783335 2.432044
H  1.443457 1.726225 1.363719
H  0.215603 -2.852491 -0.769195
H  0.191471 -1.769528 -2.178796
H  -0.338797 2.955695 0.5398
H  0.202023 4.063055 -0.721162
H  -0.733133 2.650747 -1.158414
H  1.105976 1.66025 -2.699559
H  1.98645 3.156515 -2.462504
H  2.773622 1.61521 -2.127832
H  -3.291775 2.194619 -1.005735
H  -4.521147 1.005079 -1.341356
H  -4.007565 -1.432007 2.218244
H  -3.172368 0.001802 2.749434
H  -3.819588 2.269813 1.346476
H  -5.367649 2.292566 0.530116
H  -5.587246 -0.179684 0.891965
H  -5.465741 0.698306 2.40087
totalener: -1094.84940125 hartree
nucrepener: 2214.49676594 hartree
electener: -3309.34616720 hartree
oneelecener: -5890.63201206 hartree
twoeener: 2581.28584486 hartree
kineticenergy: 1090.10370812 hartree
xcener: -105.973775952784 hartree
chargesum: -0.0000000
charge: -0.248975 -0.362535 -0.325323 -0.315514 -0.092493 0.130667 -0.031738 -0.145159 -0.246536 -0.272693 -0.188755 0.343685 -0.006098 0.067065 -0.233400 -0.252077 -0.055164 -0.067504 -0.078612 -0.076256 -0.126999 -0.135294 0.204404 0.237400 0.098962 0.091090 0.071291 0.085399 0.093037 0.086578 0.087747 0.096138 0.087506 0.127507 0.127941 0.078162 0.101675 0.072190 0.101639 0.092196 0.086312 0.096109 0.097114 0.094449 0.093322 0.074757 0.080227 0.075705 0.080851
qa: -0.2490 -0.3625 -0.3253 -0.3155 -0.0925 0.1307 -0.0317 -0.1452 -0.2465 -0.2727 -0.1888 0.3437 -0.0061 0.0671 -0.2334 -0.2521 -0.0552 -0.0675 -0.0786 -0.0763 -0.1270 -0.1353 0.2044 0.2374 0.0990 0.0911 0.0713 0.0854 0.0930 0.0866 0.0877 0.0961 0.0875 0.1275 0.1279 0.0782 0.1017 0.0722 0.1016 0.0922 0.0863 0.0961 0.0971 0.0944 0.0933 0.0748 0.0802 0.0757 0.0809
va: 2.0879 2.1440 2.1737 2.1917 3.1113 3.7185 3.8123 3.8631 3.9140 3.9287 3.8649 4.1961 3.7208 3.9208 3.9310 3.9471 3.6047 3.6422 3.9205 3.9230 3.8884 3.8989 4.2512 4.2620 1.0067 1.0274 1.0088 1.0040 1.0039 0.9999 1.0089 1.0058 1.0066 1.0011 1.0064 1.0078 1.0007 1.0100 1.0063 1.0025 1.0070 1.0140 1.0094 1.0177 1.0091 1.0109 1.0121 1.0088 1.0120
dispcorr: -0.028071850 hartree
energy: -1094.877473103458
dipole: 2.60608 -3.89039 -1.28431 17.08165 -15.89892 1.18272 9.84473 -8.86824 0.97649
magnitude: 2.00046 au
magnitude: 5.08476 debye
