program: Orca
programVersion: 5.0.2
elementType: O O O O N C C C C C C C C C C C C C C C C C C C H H H H H H H H H H H H H H H H H H H H H H H H H
charge: 0
multiplicity: 1
keywords: wb97x-d3
keywords: def2-TZVPP
keywords: def2/J RIJCOSX
keywords: DEFGRID2
keywords: scfconv7
keywords: smallprint printgap noloewdin
keywords: NOSOSCF
formula: C19H25NO4
InChI: InChI=1/C19H25NO4/c1-11(2)9-14-15(19(14,3)4)18(23)24-10-20-16(21)12-7-5-6-8-13(12)17(20)22/h9,14-15H,5-8,10H2,1-4H3
49 atoms
O  1.101016 -1.740555 -0.981801
O  1.924036 -1.637865 1.103091
O  -1.636786 -1.462439 -2.744861
O  -1.296622 -1.25728 1.793947
N  -1.178248 -1.644674 -0.487712
C  4.180721 0.143277 -0.025773
C  3.006401 1.061797 0.033592
C  2.8825 -0.309463 -0.649404
C  5.262332 0.498182 -1.021869
C  4.733287 -0.4961 1.224829
C  2.277795 1.357715 1.289209
C  1.962398 -1.29093 -0.042536
C  1.065135 1.909012 1.352818
C  -0.026036 -2.487071 -0.5682
C  0.397694 2.174999 2.667416
C  0.261695 2.28285 0.143658
C  -2.822663 -0.149393 -1.097095
C  -2.715684 -0.08677 0.229373
C  -3.772767 0.643682 -1.91623
C  -3.512913 0.805106 1.108032
C  -4.824536 1.280204 -1.00528
C  -4.198239 1.874982 0.256087
C  -1.837073 -1.138807 -1.607555
C  -1.6609 -1.038596 0.673865
H  3.025263 1.87913 -0.681612
H  2.840229 -0.282912 -1.732251
H  5.978109 1.193335 -0.579768
H  5.811457 -0.39136 -1.335225
H  4.856266 0.96956 -1.918073
H  3.975503 -0.762952 1.953862
H  5.277236 -1.407728 0.973083
H  5.440616 0.187594 1.6985
H  2.774124 1.108254 2.220071
H  0.130139 -2.960481 0.399943
H  -0.190999 -3.242697 -1.33281
H  -0.482901 1.537784 2.784086
H  1.059212 1.975931 3.509071
H  0.057601 3.211095 2.740938
H  0.153308 3.368562 0.068096
H  0.694386 1.923497 -0.788412
H  -0.751577 1.877733 0.211881
H  -3.219958 1.411253 -2.46794
H  -4.237722 0.012218 -2.676563
H  -4.251117 0.212316 1.657881
H  -2.87266 1.257639 1.869453
H  -5.371775 2.049268 -1.552379
H  -5.558393 0.521206 -0.718815
H  -4.95766 2.388878 0.84708
H  -3.461211 2.632101 -0.02914
totalener: -1094.84836980 hartree
nucrepener: 2209.44084704 hartree
electener: -3304.28921683 hartree
oneelecener: -5880.85047814 hartree
twoeener: 2576.56126131 hartree
kineticenergy: 1090.09753815 hartree
xcener: -105.972145339661 hartree
chargesum: -0.0000000
charge: -0.265467 -0.351537 -0.316104 -0.292002 -0.102831 0.145663 -0.064209 -0.107007 -0.242602 -0.279778 -0.163302 0.325969 0.000197 0.069567 -0.215408 -0.236585 -0.070534 -0.101833 -0.071173 -0.084505 -0.133882 -0.133172 0.261979 0.205817 0.089677 0.085897 0.088787 0.091253 0.070705 0.103297 0.085883 0.088867 0.087544 0.134635 0.118961 0.083445 0.082005 0.083596 0.106940 0.090611 0.030993 0.091762 0.095518 0.101953 0.097492 0.079803 0.075259 0.083534 0.074324
qa: -0.2655 -0.3515 -0.3161 -0.2920 -0.1028 0.1457 -0.0642 -0.1070 -0.2426 -0.2798 -0.1633 0.3260 0.0002 0.0696 -0.2154 -0.2366 -0.0705 -0.1018 -0.0712 -0.0845 -0.1339 -0.1332 0.2620 0.2058 0.0897 0.0859 0.0888 0.0913 0.0707 0.1033 0.0859 0.0889 0.0875 0.1346 0.1190 0.0834 0.0820 0.0836 0.1069 0.0906 0.0310 0.0918 0.0955 0.1020 0.0975 0.0798 0.0753 0.0835 0.0743
va: 2.1165 2.1364 2.1981 2.2065 3.0844 3.7456 3.8781 3.8320 3.9000 3.9084 3.9095 4.1873 3.7328 3.9269 3.9387 3.9418 3.6047 3.5593 3.9208 3.9065 3.8954 3.8880 4.2747 4.2653 1.0038 1.0304 1.0046 1.0052 1.0066 1.0224 1.0045 0.9976 1.0144 1.0179 1.0002 1.0088 1.0155 0.9954 1.0016 1.0111 1.0084 1.0104 1.0183 1.0100 1.0187 1.0119 1.0085 1.0128 1.0093
dispcorr: -0.027760221 hartree
energy: -1094.876130017295
dipole: 6.32183 -7.13817 -0.81634 20.37600 -19.24747 1.12853 4.95915 -5.34786 -0.38872
magnitude: 1.44606 au
magnitude: 3.67559 debye
