program: Orca
programVersion: 5.0.2
elementType: O O O O N C C C C C C C C C C C C C C C C C C C H H H H H H H H H H H H H H H H H H H H H H H H H
charge: 0
multiplicity: 1
keywords: wb97x-d3
keywords: def2-TZVPP
keywords: def2/J RIJCOSX
keywords: DEFGRID2
keywords: scfconv7
keywords: smallprint printgap noloewdin
keywords: NOSOSCF
formula: C19H25NO4
InChI: InChI=1/C19H25NO4/c1-11(2)9-14-15(19(14,3)4)18(23)24-10-20-16(21)12-7-5-6-8-13(12)17(20)22/h9,14-15H,5-8,10H2,1-4H3
49 atoms
O  1.211308 -1.858436 -1.130223
O  1.303351 -1.290086 1.029747
O  -1.222421 -0.582172 -2.692931
O  -1.597828 -2.192097 1.550933
N  -1.086529 -1.626993 -0.638367
C  4.053307 -0.041223 0.447213
C  3.074602 0.982332 -0.01792
C  2.955256 -0.470411 -0.499498
C  5.430726 0.008392 -0.174879
C  4.084689 -0.497668 1.88569
C  2.045457 1.579307 0.865959
C  1.768637 -1.235685 -0.074785
C  0.959004 2.218225 0.43076
C  -0.015147 -2.529508 -0.913786
C  -0.026656 2.818444 1.385716
C  0.626119 2.384512 -1.020795
C  -2.545375 0.145782 -0.801143
C  -2.629633 -0.309315 0.448096
C  -3.327736 1.28251 -1.349539
C  -3.526298 0.235428 1.497103
C  -3.969192 2.064499 -0.201375
C  -4.579246 1.138324 0.851869
C  -1.557711 -0.682317 -1.544929
C  -1.721457 -1.47892 0.598266
H  3.438581 1.646684 -0.796694
H  3.252287 -0.648273 -1.526584
H  5.40014 0.337593 -1.214485
H  6.072957 0.701235 0.371636
H  5.904557 -0.974384 -0.151863
H  3.110018 -0.522499 2.361426
H  4.504896 -1.50238 1.952854
H  4.73116 0.166657 2.462453
H  2.198447 1.494862 1.935934
H  0.046947 -3.237549 -0.086609
H  -0.203886 -3.063375 -1.842498
H  0.278616 2.693422 2.423589
H  -0.16261 3.886844 1.198929
H  -1.00895 2.351779 1.266862
H  -0.416145 2.118505 -1.209747
H  0.738022 3.427195 -1.330673
H  1.239566 1.770554 -1.676967
H  -2.690609 1.928647 -1.958133
H  -4.09276 0.898719 -2.032413
H  -3.990692 -0.578032 2.058716
H  -2.928196 0.792513 2.226159
H  -3.210796 2.69658 0.270307
H  -4.731304 2.739108 -0.594182
H  -5.34659 0.515397 0.382952
H  -5.084767 1.725808 1.619672
totalener: -1094.84856521 hartree
nucrepener: 2239.37210468 hartree
electener: -3334.22066989 hartree
oneelecener: -5940.82743961 hartree
twoeener: 2606.60676972 hartree
kineticenergy: 1090.10917124 hartree
xcener: -105.976559369338 hartree
chargesum: -0.0000000
charge: -0.264270 -0.372481 -0.313253 -0.299692 -0.113500 0.140958 -0.064058 -0.108415 -0.242192 -0.277148 -0.149323 0.341881 -0.017721 0.085542 -0.184857 -0.246127 -0.144954 -0.052661 -0.074462 -0.088846 -0.155673 -0.118477 0.230524 0.270490 0.092883 0.085195 0.071581 0.088754 0.090721 0.104168 0.086448 0.087626 0.086370 0.126983 0.121593 0.086051 0.091003 0.028897 0.049209 0.106844 0.096521 0.098203 0.102561 0.099671 0.096425 0.081980 0.084762 0.074851 0.079413
qa: -0.2643 -0.3725 -0.3133 -0.2997 -0.1135 0.1410 -0.0641 -0.1084 -0.2422 -0.2771 -0.1493 0.3419 -0.0177 0.0855 -0.1849 -0.2461 -0.1450 -0.0527 -0.0745 -0.0888 -0.1557 -0.1185 0.2305 0.2705 0.0929 0.0852 0.0716 0.0888 0.0907 0.1042 0.0864 0.0876 0.0864 0.1270 0.1216 0.0861 0.0910 0.0289 0.0492 0.1068 0.0965 0.0982 0.1026 0.0997 0.0964 0.0820 0.0848 0.0749 0.0794
va: 2.1259 2.1046 2.1978 2.2145 3.0687 3.7463 3.8841 3.8367 3.9008 3.9069 3.8812 4.1606 3.7203 3.9260 3.9419 3.9467 3.6002 3.5335 3.9028 3.9211 3.8979 3.8811 4.2594 4.2644 1.0041 1.0300 1.0069 1.0046 1.0052 1.0224 1.0045 0.9978 1.0150 1.0139 0.9960 1.0164 0.9993 1.0089 1.0128 0.9999 1.0115 1.0106 1.0078 1.0212 1.0052 1.0064 1.0141 1.0090 1.0130
dispcorr: -0.028707006 hartree
energy: -1094.877272212740
dipole: 6.58831 -7.00004 -0.41173 20.27285 -19.31866 0.95419 5.77457 -5.95693 -0.18236
magnitude: 1.05511 au
magnitude: 2.68187 debye
