program: Orca
programVersion: 5.0.2
elementType: O O O O N C C C C C C C C C C C C C C C C C C C H H H H H H H H H H H H H H H H H H H H H H H H H
charge: 0
multiplicity: 1
keywords: wb97x-d3
keywords: def2-TZVPP
keywords: def2/J RIJCOSX
keywords: DEFGRID2
keywords: scfconv7
keywords: smallprint printgap noloewdin
keywords: NOSOSCF
formula: C19H25NO4
InChI: InChI=1/C19H25NO4/c1-11(2)9-14-15(19(14,3)4)18(23)24-10-20-16(21)12-7-5-6-8-13(12)17(20)22/h9,14-15H,5-8,10H2,1-4H3
49 atoms
O  0.96844 -1.460969 -1.18393
O  0.701254 0.731803 -0.853702
O  -2.201301 0.685826 -1.936643
O  -1.123794 -2.987906 0.517092
N  -1.378938 -1.247522 -0.969373
C  2.827963 0.129734 1.414509
C  3.54265 0.794433 0.28909
C  2.643444 -0.3987 -0.003354
C  3.626769 -0.765054 2.330456
C  1.693154 0.833965 2.115683
C  3.234768 2.185337 -0.130666
C  1.360452 -0.267011 -0.708297
C  3.292078 2.653889 -1.378576
C  -0.285585 -1.541212 -1.841897
C  2.995218 4.090467 -1.682809
C  3.620337 1.803666 -2.566455
C  -3.08859 -0.174406 0.137382
C  -2.784314 -1.255259 0.856274
C  -4.142835 0.8115 0.476854
C  -3.459867 -1.659718 2.113708
C  -4.583259 0.606462 1.927369
C  -4.76351 -0.872852 2.265849
C  -2.203162 -0.129797 -1.052565
C  -1.677359 -1.973916 0.175327
H  4.592999 0.525127 0.200935
H  3.157397 -1.330902 -0.208124
H  4.440054 -1.266494 1.803973
H  4.06738 -0.184132 3.143689
H  2.994769 -1.535158 2.777512
H  2.083466 1.414417 2.954339
H  1.136668 1.517846 1.479619
H  0.985918 0.108658 2.523641
H  2.977036 2.879406 0.664925
H  -0.348497 -2.567282 -2.196725
H  -0.336262 -0.870007 -2.699588
H  3.847122 4.578655 -2.16393
H  2.15682 4.176171 -2.379569
H  2.744453 4.658298 -0.786431
H  2.79116 1.801649 -3.279336
H  4.484421 2.204674 -3.103358
H  3.841765 0.769382 -2.308469
H  -3.778326 1.829405 0.318184
H  -4.988272 0.685044 -0.207414
H  -3.650063 -2.735764 2.116889
H  -2.791334 -1.46949 2.959799
H  -3.834937 1.042715 2.595367
H  -5.513668 1.147376 2.106177
H  -5.522076 -1.304554 1.606333
H  -5.138119 -0.980332 3.284838
elementType: O N C H
totalener: -1094.87513631 hartree
nucrepener: 2168.24922920 hartree
electener: -3263.12436552 hartree
oneelecener: -5799.59427071 hartree
twoeener: 2536.46990519 hartree
cpcmener: -0.03324480 hartree
kineticenergy: 1090.04767333 hartree
xcener: -105.973374673760 hartree
chargesum: 0.0000000
charge: -0.285900 -0.453959 -0.402847 -0.411179 -0.100683 0.134889 -0.016349 -0.123790 -0.264917 -0.301328 -0.263033 0.400534 -0.023709 0.084189 -0.224572 -0.268146 -0.060473 -0.081673 -0.076790 -0.072666 -0.135094 -0.137944 0.312027 0.309951 0.115469 0.096520 0.086162 0.093969 0.095976 0.102307 0.098366 0.099142 0.120056 0.142329 0.131987 0.094467 0.094195 0.088080 0.098420 0.106455 0.093414 0.094021 0.100594 0.092886 0.100661 0.078696 0.080553 0.078044 0.080692
qa: -0.2859 -0.4540 -0.4028 -0.4112 -0.1007 0.1349 -0.0163 -0.1238 -0.2649 -0.3013 -0.2630 0.4005 -0.0237 0.0842 -0.2246 -0.2681 -0.0605 -0.0817 -0.0768 -0.0727 -0.1351 -0.1379 0.3120 0.3100 0.1155 0.0965 0.0862 0.0940 0.0960 0.1023 0.0984 0.0991 0.1201 0.1423 0.1320 0.0945 0.0942 0.0881 0.0984 0.1065 0.0934 0.0940 0.1006 0.0929 0.1007 0.0787 0.0806 0.0780 0.0807
va: 2.1100 2.0360 2.1135 2.1053 3.0682 3.7355 3.8421 3.8169 3.9010 3.9068 3.8575 4.0933 3.7066 3.8990 3.9262 3.9447 3.6462 3.6864 3.9179 3.9184 3.9147 3.9154 4.2128 4.2170 1.0033 1.0303 1.0053 1.0018 1.0021 0.9991 1.0127 1.0020 1.0001 0.9923 1.0150 0.9966 0.9968 1.0073 0.9988 0.9997 1.0044 1.0158 1.0045 1.0158 1.0051 1.0066 1.0095 1.0063 1.0093
dispcorr: -0.024925085 hartree
energy: -1094.900061397914
dipole: 10.65563 -11.07953 -0.42390 13.55936 -13.80142 -0.24207 10.50314 -9.45100 1.05214
magnitude: 1.15986 au
magnitude: 2.94813 debye
