program: Orca
programVersion: 5.0.2
elementType: O O O O N C C C C C C C C C C C C C C C C C C C H H H H H H H H H H H H H H H H H H H H H H H H H
charge: 0
multiplicity: 1
keywords: wb97x-d3
keywords: def2-TZVPP
keywords: def2/J RIJCOSX
keywords: DEFGRID2
keywords: scfconv7
keywords: smallprint printgap noloewdin
keywords: NOSOSCF
formula: C19H25NO4
InChI: InChI=1/C19H25NO4/c1-11(2)9-14-15(19(14,3)4)18(23)24-10-20-16(21)12-7-5-6-8-13(12)17(20)22/h9,14-15H,5-8,10H2,1-4H3
49 atoms
O  1.063599 -1.632258 -1.192815
O  0.685797 0.564841 -1.049114
O  -2.172557 0.282864 -2.222157
O  -0.931141 -2.943218 0.732783
N  -1.289057 -1.474273 -1.006251
C  2.655281 0.044893 1.421387
C  3.370762 0.852421 0.391633
C  2.637751 -0.406923 -0.034111
C  3.478975 -0.809411 2.352759
C  1.394044 0.572783 2.058095
C  2.951651 2.233019 0.034182
C  1.38245 -0.387207 -0.802404
C  3.080757 2.798816 -1.167067
C  -0.185018 -1.841922 -1.83557
C  2.673363 4.220689 -1.405167
C  3.599912 2.07284 -2.368804
C  -2.950569 -0.240476 0.0049
C  -2.602785 -1.197566 0.865549
C  -3.988458 0.790497 0.247555
C  -3.207772 -1.405513 2.203529
C  -4.339256 0.815473 1.736318
C  -4.499366 -0.591928 2.310219
C  -2.125405 -0.381383 -1.220567
C  -1.52011 -2.007113 0.255028
H  4.448359 0.703266 0.378339
H  3.260614 -1.268757 -0.246029
H  2.912666 -1.67808 2.694685
H  4.389344 -1.172686 1.87399
H  3.775263 -0.238487 3.235614
H  0.756859 -0.251723 2.385915
H  1.642525 1.162296 2.9429
H  0.801841 1.207554 1.403077
H  2.550948 2.836173 0.844541
H  -0.208715 -2.907157 -2.052793
H  -0.254769 -1.29029 -2.773295
H  3.514274 4.819451 -1.765262
H  1.899814 4.280686 -2.175693
H  2.285214 4.694495 -0.503353
H  2.838973 2.035664 -3.153327
H  4.457615 2.596508 -2.799403
H  3.908199 1.050902 -2.155042
H  -3.637408 1.769289 -0.087876
H  -4.872924 0.564504 -0.356979
H  -3.398902 -2.467524 2.375221
H  -2.491338 -1.100843 2.973738
H  -3.549659 1.340622 2.281626
H  -5.255876 1.387626 1.886599
H  -5.296954 -1.113005 1.772753
H  -4.811173 -0.537241 3.354226
elementType: O N C H
totalener: -1094.87396009 hartree
nucrepener: 2189.04299606 hartree
electener: -3283.91695616 hartree
oneelecener: -5841.13107043 hartree
twoeener: 2557.21411427 hartree
cpcmener: -0.03274153 hartree
kineticenergy: 1090.05045147 hartree
xcener: -105.973690993376 hartree
chargesum: 0.0000000
charge: -0.281188 -0.449357 -0.401227 -0.411421 -0.104052 0.148265 -0.022271 -0.126023 -0.265337 -0.307142 -0.258519 0.388688 -0.027147 0.086983 -0.225672 -0.268186 -0.041905 -0.088633 -0.076153 -0.070588 -0.135698 -0.137674 0.303258 0.307641 0.115195 0.098427 0.096179 0.086556 0.093823 0.097325 0.105581 0.097582 0.120895 0.141014 0.132465 0.094868 0.093928 0.087786 0.098228 0.104693 0.093651 0.093671 0.099811 0.093708 0.100091 0.078658 0.080935 0.077861 0.080430
qa: -0.2812 -0.4494 -0.4012 -0.4114 -0.1041 0.1483 -0.0223 -0.1260 -0.2653 -0.3071 -0.2585 0.3887 -0.0271 0.0870 -0.2257 -0.2682 -0.0419 -0.0886 -0.0762 -0.0706 -0.1357 -0.1377 0.3033 0.3076 0.1152 0.0984 0.0962 0.0866 0.0938 0.0973 0.1056 0.0976 0.1209 0.1410 0.1325 0.0949 0.0939 0.0878 0.0982 0.1047 0.0937 0.0937 0.0998 0.0937 0.1001 0.0787 0.0809 0.0779 0.0804
va: 2.1108 2.0402 2.1153 2.1018 3.0665 3.7335 3.8494 3.8130 3.9000 3.9083 3.8527 4.1182 3.7073 3.8996 3.9267 3.9472 3.6254 3.6908 3.9150 3.9189 3.9139 3.9165 4.2155 4.2025 1.0030 1.0291 1.0021 1.0049 1.0018 1.0058 0.9998 1.0110 0.9997 0.9916 1.0142 0.9965 0.9964 1.0073 0.9987 1.0002 1.0036 1.0159 1.0046 1.0156 1.0059 1.0070 1.0093 1.0061 1.0095
dispcorr: -0.025770237 hartree
energy: -1094.899730330237
dipole: 9.62824 -10.01298 -0.38474 15.49338 -15.56417 -0.07079 11.56298 -10.38498 1.17800
magnitude: 1.24126 au
magnitude: 3.15502 debye
