program: Orca
programVersion: 5.0.2
elementType: O O O O N C C C C C C C C C C C C C C C C C C C H H H H H H H H H H H H H H H H H H H H H H H H H
charge: 0
multiplicity: 1
keywords: wb97x-d3
keywords: def2-TZVPP
keywords: def2/J RIJCOSX
keywords: DEFGRID2
keywords: scfconv7
keywords: smallprint printgap noloewdin
keywords: NOSOSCF
formula: C19H25NO4
InChI: InChI=1/C19H25NO4/c1-11(2)9-14-15(19(14,3)4)18(23)24-10-20-16(21)12-7-5-6-8-13(12)17(20)22/h9,14-15H,5-8,10H2,1-4H3
49 atoms
O  1.122946 -0.909256 -0.557338
O  2.623768 -2.163002 -1.615198
O  -1.604827 0.575314 -2.140975
O  -1.231786 -2.443161 1.231626
N  -1.149925 -1.138022 -0.666148
C  3.335655 -0.149334 1.39467
C  3.33942 0.902635 0.340193
C  3.409799 -0.568368 -0.065747
C  4.612625 -0.37044 2.17163
C  2.101815 -0.391273 2.229655
C  2.171984 1.786591 0.08781
C  2.368923 -1.288239 -0.816863
C  1.846108 2.318125 -1.092486
C  0.070856 -1.615341 -1.212027
C  0.712324 3.287261 -1.226111
C  2.569261 2.006766 -2.36557
C  -2.960286 0.196266 -0.170809
C  -2.854702 -0.693227 0.81749
C  -4.001239 1.248177 -0.265366
C  -3.771567 -0.792965 1.978408
C  -4.718057 1.381519 1.080234
C  -5.036097 0.021864 1.701334
C  -1.859816 -0.039884 -1.137945
C  -1.675829 -1.55366 0.553249
H  4.298178 1.393811 0.189229
H  4.392423 -0.895822 -0.385509
H  5.499373 -0.191137 1.562135
H  4.660813 0.301754 3.031081
H  4.670117 -1.39379 2.548274
H  2.166845 0.20263 3.144097
H  1.169481 -0.12347 1.74069
H  2.033125 -1.439171 2.528013
H  1.581693 2.064317 0.956991
H  0.15367 -2.687927 -1.038903
H  0.086377 -1.425863 -2.285039
H  1.066592 4.24759 -1.611282
H  -0.035901 2.929599 -1.937294
H  0.213281 3.472264 -0.274458
H  1.870733 1.639399 -3.122363
H  3.02662 2.908299 -2.783109
H  3.355265 1.26262 -2.247088
H  -3.553273 2.199039 -0.564401
H  -4.708269 0.98626 -1.059154
H  -4.016514 -1.838325 2.181174
H  -3.260246 -0.425038 2.873963
H  -4.088739 1.954186 1.767391
H  -5.63654 1.954968 0.947476
H  -5.686491 -0.541893 1.026528
H  -5.592694 0.157598 2.629684
elementType: O N C H
totalener: -1094.87509984 hartree
nucrepener: 2188.63158968 hartree
electener: -3283.50668951 hartree
oneelecener: -5839.29123171 hartree
twoeener: 2555.78454220 hartree
cpcmener: -0.03073960 hartree
kineticenergy: 1090.04537335 hartree
xcener: -105.971668184156 hartree
chargesum: -0.0000000
charge: -0.252867 -0.472483 -0.413788 -0.408310 -0.095052 0.151603 -0.017527 -0.140447 -0.269256 -0.296192 -0.248330 0.407274 -0.038768 0.066696 -0.234803 -0.260924 -0.054342 -0.046833 -0.071436 -0.073647 -0.135134 -0.135609 0.300002 0.291556 0.113493 0.094850 0.086609 0.092861 0.096237 0.099911 0.082328 0.105278 0.121471 0.134037 0.135359 0.103693 0.087769 0.090820 0.096007 0.107222 0.092214 0.093814 0.101245 0.094162 0.101731 0.078194 0.080265 0.078523 0.080524
qa: -0.2529 -0.4725 -0.4138 -0.4083 -0.0951 0.1516 -0.0175 -0.1404 -0.2693 -0.2962 -0.2483 0.4073 -0.0388 0.0667 -0.2348 -0.2609 -0.0543 -0.0468 -0.0714 -0.0736 -0.1351 -0.1356 0.3000 0.2916 0.1135 0.0949 0.0866 0.0929 0.0962 0.0999 0.0823 0.1053 0.1215 0.1340 0.1354 0.1037 0.0878 0.0908 0.0960 0.1072 0.0922 0.0938 0.1012 0.0942 0.1017 0.0782 0.0803 0.0785 0.0805
va: 2.1004 2.0326 2.0911 2.1020 3.1334 3.6947 3.8027 3.8676 3.9070 3.9170 3.8350 4.1047 3.7096 3.8990 3.9209 3.9426 3.6942 3.6778 3.9175 3.9168 3.9155 3.9167 4.1833 4.1928 1.0051 1.0281 1.0056 1.0023 1.0013 0.9999 1.0048 1.0020 1.0003 1.0037 1.0036 0.9976 1.0049 1.0059 1.0007 0.9991 1.0066 1.0147 1.0048 1.0150 1.0050 1.0066 1.0097 1.0065 1.0098
dispcorr: -0.026459254 hartree
energy: -1094.901559089764
dipole: 3.58271 -5.24438 -1.66167 16.29706 -14.76128 1.53579 9.20987 -7.86529 1.34458
magnitude: 2.63205 au
magnitude: 6.69013 debye
