program: Orca
programVersion: 5.0.2
elementType: O O O O N C C C C C C C C C C C C C C C C C C C H H H H H H H H H H H H H H H H H H H H H H H H H
charge: 0
multiplicity: 1
keywords: wb97x-d3
keywords: def2-TZVPP
keywords: def2/J RIJCOSX
keywords: DEFGRID2
keywords: scfconv7
keywords: smallprint printgap noloewdin
keywords: NOSOSCF
formula: C19H25NO4
InChI: InChI=1/C19H25NO4/c1-11(2)9-14-15(19(14,3)4)18(23)24-10-20-16(21)12-7-5-6-8-13(12)17(20)22/h9,14-15H,5-8,10H2,1-4H3
49 atoms
O  1.123107 -0.696623 -0.778274
O  2.603767 -1.599318 -2.1693
O  -1.049103 -2.688274 0.709816
O  -1.774987 0.985004 -1.861565
N  -1.144436 -0.983524 -0.838145
C  3.395732 -0.266274 1.198849
C  3.347413 0.971824 0.371169
C  3.421735 -0.391357 -0.316267
C  4.705382 -0.60203 1.874571
C  2.198625 -0.689404 2.015678
C  2.15685 1.859947 0.336479
C  2.364232 -0.952682 -1.173193
C  1.754533 2.578962 -0.714086
C  0.058107 -1.258837 -1.541149
C  0.591034 3.517064 -0.615908
C  2.410652 2.518751 -2.058357
C  -2.783486 -0.99972 0.779009
C  -2.985429 0.088488 0.03428
C  -3.632986 -1.426851 1.916866
C  -4.078286 1.070243 0.23626
C  -4.947827 -0.645165 1.891477
C  -4.726158 0.839107 1.603044
C  -1.578637 -1.699791 0.272658
C  -1.935245 0.146304 -1.012858
H  4.292702 1.503469 0.288405
H  4.396118 -0.629151 -0.727458
H  5.564579 -0.28931 1.279448
H  4.77527 -0.102921 2.8435
H  4.79444 -1.676387 2.048232
H  2.158902 -1.776059 2.112737
H  2.289071 -0.276652 3.022836
H  1.244393 -0.356518 1.617877
H  1.611334 1.967236 1.270154
H  0.181688 -2.336572 -1.646786
H  0.009255 -0.806338 -2.531452
H  -0.192378 3.25233 -1.330017
H  0.150331 3.525003 0.381023
H  0.893559 4.539856 -0.857671
H  1.676755 2.284713 -2.834125
H  2.838597 3.489394 -2.324085
H  3.208173 1.779924 -2.117919
H  -3.816868 -2.502942 1.87036
H  -3.09503 -1.255096 2.854977
H  -3.691839 2.089236 0.15539
H  -4.814336 0.96416 -0.56731
H  -5.603427 -1.069708 1.125682
H  -5.463165 -0.766966 2.845444
H  -4.086746 1.266948 2.380638
H  -5.675583 1.374314 1.651216
elementType: O N C H
totalener: -1094.87496565 hartree
nucrepener: 2187.60384486 hartree
electener: -3282.47881051 hartree
oneelecener: -5837.23702421 hartree
twoeener: 2554.75821370 hartree
cpcmener: -0.03063983 hartree
kineticenergy: 1090.04301753 hartree
xcener: -105.971387893731 hartree
chargesum: -0.0000000
charge: -0.252526 -0.472702 -0.408710 -0.413849 -0.094842 0.148684 -0.015561 -0.137917 -0.267777 -0.297034 -0.251062 0.403633 -0.037363 0.065504 -0.232963 -0.259786 -0.051527 -0.052560 -0.073848 -0.070994 -0.135705 -0.137642 0.294514 0.301681 0.112594 0.095757 0.086503 0.093060 0.095828 0.104803 0.099849 0.084142 0.120734 0.134746 0.135252 0.087798 0.090261 0.102988 0.096227 0.108382 0.091233 0.094301 0.101220 0.093467 0.101229 0.078573 0.081102 0.078814 0.081490
qa: -0.2525 -0.4727 -0.4087 -0.4138 -0.0948 0.1487 -0.0156 -0.1379 -0.2678 -0.2970 -0.2511 0.4036 -0.0374 0.0655 -0.2330 -0.2598 -0.0515 -0.0526 -0.0738 -0.0710 -0.1357 -0.1376 0.2945 0.3017 0.1126 0.0958 0.0865 0.0931 0.0958 0.1048 0.0998 0.0841 0.1207 0.1347 0.1353 0.0878 0.0903 0.1030 0.0962 0.1084 0.0912 0.0943 0.1012 0.0935 0.1012 0.0786 0.0811 0.0788 0.0815
va: 2.1012 2.0316 2.1018 2.0917 3.1312 3.6973 3.8027 3.8620 3.9065 3.9156 3.8377 4.1087 3.7091 3.8976 3.9204 3.9415 3.6796 3.6924 3.9184 3.9165 3.9149 3.9152 4.1923 4.1843 1.0053 1.0279 1.0055 1.0021 1.0017 1.0023 0.9999 1.0045 1.0009 1.0031 1.0038 1.0048 1.0063 0.9977 1.0006 0.9989 1.0075 1.0148 1.0053 1.0150 1.0051 1.0066 1.0096 1.0066 1.0093
dispcorr: -0.026463419 hartree
energy: -1094.901429070766
dipole: 3.50406 -5.15954 -1.65548 13.78225 -12.69560 1.08665 12.17901 -10.46690 1.71210
magnitude: 2.61777 au
magnitude: 6.65384 debye
