program: Orca
programVersion: 5.0.2
elementType: O O O O N C C C C C C C C C C C C C C C C C C C H H H H H H H H H H H H H H H H H H H H H H H H H
charge: 0
multiplicity: 1
keywords: wb97x-d3
keywords: def2-TZVPP
keywords: def2/J RIJCOSX
keywords: DEFGRID2
keywords: scfconv7
keywords: smallprint printgap noloewdin
keywords: NOSOSCF
formula: C19H25NO4
InChI: InChI=1/C19H25NO4/c1-11(2)9-14-15(19(14,3)4)18(23)24-10-20-16(21)12-7-5-6-8-13(12)17(20)22/h9,14-15H,5-8,10H2,1-4H3
49 atoms
O  0.477905 -0.931213 0.258739
O  1.713141 -0.327304 -1.509345
O  -1.733701 0.60766 -1.518638
O  -2.395114 -2.979792 1.184726
N  -1.73031 -1.347635 -0.303888
C  2.530611 2.069403 0.325365
C  3.58956 1.039212 0.566166
C  2.112968 0.645496 0.651374
C  2.27876 3.068044 1.430463
C  2.315084 2.656153 -1.048012
C  4.4939 0.546512 -0.489257
C  1.453627 -0.223888 -0.336135
C  5.80403 0.307721 -0.355705
C  -0.38021 -1.737951 -0.53754
C  6.607285 -0.175875 -1.526915
C  6.599394 0.489804 0.89985
C  -3.665324 -0.100698 -0.236807
C  -3.860825 -1.162387 0.54627
C  -4.662197 0.967092 -0.492693
C  -5.119595 -1.47209 1.266482
C  -5.810403 0.846434 0.511407
C  -6.248348 -0.60404 0.70776
C  -2.291563 -0.174991 -0.79306
C  -2.618025 -1.974234 0.561735
H  4.035633 1.090146 1.553256
H  1.745557 0.501808 1.660567
H  2.958592 3.917893 1.340807
H  1.2580 3.453353 1.383236
H  2.423489 2.630856 2.419329
H  2.583797 1.995755 -1.867156
H  1.270554 2.943566 -1.183512
H  2.918178 3.560452 -1.150127
H  4.064098 0.373097 -1.467557
H  -0.25669 -2.776819 -0.23724
H  -0.146175 -1.646337 -1.595997
H  5.995379 -0.313201 -2.418466
H  7.407543 0.5272 -1.773966
H  7.094057 -1.129113 -1.303472
H  7.102524 -0.440678 1.17439
H  7.389447 1.22972 0.7465
H  6.01281 0.812442 1.757593
H  -4.189684 1.950176 -0.429245
H  -5.031841 0.877152 -1.519147
H  -5.359301 -2.533753 1.171602
H  -4.981375 -1.289312 2.336867
H  -5.493543 1.261617 1.472242
H  -6.65419 1.450069 0.174337
H  -6.576347 -1.016041 -0.250847
H  -7.108732 -0.648264 1.376857
elementType: O N C H
totalener: -1094.87702495 hartree
nucrepener: 2062.15634524 hartree
electener: -3157.03337019 hartree
oneelecener: -5586.86095780 hartree
twoeener: 2429.82758761 hartree
cpcmener: -0.03098124 hartree
kineticenergy: 1090.04384389 hartree
xcener: -105.973269058773 hartree
chargesum: -0.0000000
charge: -0.286961 -0.457849 -0.411440 -0.410037 -0.098055 0.104285 0.032270 -0.103771 -0.262093 -0.281760 -0.288803 0.409437 -0.060722 0.079647 -0.218466 -0.253753 -0.057889 -0.084053 -0.070321 -0.075911 -0.136438 -0.133266 0.312989 0.325554 0.116838 0.096548 0.094940 0.093927 0.086179 0.095990 0.101006 0.097559 0.123597 0.124602 0.138911 0.088423 0.092095 0.091907 0.094967 0.096261 0.087795 0.093675 0.100504 0.093756 0.101065 0.078195 0.080843 0.077477 0.080346
qa: -0.2870 -0.4578 -0.4114 -0.4100 -0.0981 0.1043 0.0323 -0.1038 -0.2621 -0.2818 -0.2888 0.4094 -0.0607 0.0796 -0.2185 -0.2538 -0.0579 -0.0841 -0.0703 -0.0759 -0.1364 -0.1333 0.3130 0.3256 0.1168 0.0965 0.0949 0.0939 0.0862 0.0960 0.1010 0.0976 0.1236 0.1246 0.1389 0.0884 0.0921 0.0919 0.0950 0.0963 0.0878 0.0937 0.1005 0.0938 0.1011 0.0782 0.0808 0.0775 0.0803
va: 2.1080 2.0413 2.1037 2.1081 3.0946 3.7148 3.7371 3.8490 3.9119 3.9083 3.8530 4.0989 3.7895 3.8671 3.9221 3.9382 3.6578 3.6944 3.9203 3.9221 3.9155 3.9126 4.2247 4.2228 1.0018 1.0297 1.0016 1.0022 1.0056 1.0130 1.0013 1.0011 1.0234 1.0124 1.0179 1.0091 0.9962 0.9967 0.9973 0.9966 1.0143 1.0154 1.0051 1.0156 1.0053 1.0068 1.0095 1.0069 1.0096
dispcorr: -0.022213237 hartree
energy: -1094.899238182806
dipole: 17.21481 -18.59638 -1.38156 15.67431 -14.91464 0.75967 3.59027 -2.41365 1.17663
magnitude: 1.96730 au
magnitude: 5.00048 debye
