program: Orca
programVersion: 5.0.2
elementType: O O O O N C C C C C C C C C C C C C C C C C C C H H H H H H H H H H H H H H H H H H H H H H H H H
charge: 0
multiplicity: 1
keywords: wb97x-d3
keywords: def2-TZVPP
keywords: def2/J RIJCOSX
keywords: DEFGRID2
keywords: scfconv7
keywords: smallprint printgap noloewdin
keywords: NOSOSCF
formula: C19H25NO4
InChI: InChI=1/C19H25NO4/c1-11(2)9-14-15(19(14,3)4)18(23)24-10-20-16(21)12-7-5-6-8-13(12)17(20)22/h9,14-15H,5-8,10H2,1-4H3
49 atoms
O  1.170012 -1.357085 -0.39376
O  2.576829 -2.686071 -1.492338
O  -1.242385 -0.225994 -2.393838
O  -1.491642 -2.130467 1.722683
N  -1.112437 -1.462138 -0.452149
C  3.594476 0.059886 0.735923
C  3.18093 0.822673 -0.480695
C  3.422952 -0.677977 -0.583971
C  5.032087 0.206656 1.178611
C  2.650575 -0.16597 1.892654
C  1.838084 1.42248 -0.69679
C  2.371685 -1.670329 -0.867331
C  1.309436 2.419419 0.016098
C  0.0694 -2.195069 -0.739693
C  -0.048256 2.966411 -0.309193
C  1.991567 3.071756 1.178461
C  -2.757489 0.147117 -0.543624
C  -2.835833 -0.417203 0.662511
C  -3.647927 1.220893 -1.045409
C  -3.824349 -0.059168 1.708141
C  -4.875262 1.328925 -0.139396
C  -4.502038 1.263187 1.341348
C  -1.639944 -0.482068 -1.28639
C  -1.766952 -1.441787 0.775257
H  3.986503 1.383848 -0.950344
H  4.350392 -0.964459 -1.066235
H  5.364767 -0.675566 1.729641
H  5.708148 0.344317 0.333771
H  5.144377 1.070547 1.837312
H  2.773541 -1.169688 2.304489
H  2.885842 0.538483 2.692082
H  1.602774 -0.030239 1.640795
H  1.275333 1.053789 -1.54872
H  0.083678 -3.112658 -0.152476
H  0.091106 -2.449687 -1.798655
H  -0.006025 4.041319 -0.503554
H  -0.488023 2.484349 -1.182308
H  -0.73158 2.833304 0.534305
H  2.070238 4.149828 1.013399
H  1.412072 2.94489 2.096534
H  2.995584 2.69162 1.356991
H  -3.093457 2.165393 -1.064213
H  -3.939568 1.023764 -2.079743
H  -4.562395 -0.863373 1.7945
H  -3.33878 0.008656 2.684585
H  -5.40234 2.260613 -0.349045
H  -5.568495 0.516973 -0.3762
H  -5.392744 1.398219 1.956395
H  -3.827467 2.090115 1.580546
elementType: O N C H
totalener: -1094.87403482 hartree
nucrepener: 2205.87080076 hartree
electener: -3300.74483558 hartree
oneelecener: -5873.37178296 hartree
twoeener: 2572.62694738 hartree
cpcmener: -0.03082269 hartree
kineticenergy: 1090.04728506 hartree
xcener: -105.973376506012 hartree
chargesum: -0.0000000
charge: -0.255455 -0.469111 -0.408841 -0.408480 -0.088160 0.077450 0.000878 -0.087892 -0.272894 -0.281756 -0.267140 0.390403 -0.009965 0.070585 -0.237894 -0.263429 -0.067450 -0.052723 -0.069126 -0.068885 -0.131658 -0.137567 0.275892 0.308935 0.114022 0.092400 0.099412 0.087291 0.090411 0.115628 0.093578 0.092414 0.115758 0.135353 0.129438 0.106119 0.079246 0.092470 0.107280 0.099910 0.091820 0.101620 0.097371 0.100649 0.093148 0.081111 0.078701 0.081793 0.077338
qa: -0.2555 -0.4691 -0.4088 -0.4085 -0.0882 0.0775 0.0009 -0.0879 -0.2729 -0.2818 -0.2671 0.3904 -0.0100 0.0706 -0.2379 -0.2634 -0.0674 -0.0527 -0.0691 -0.0689 -0.1317 -0.1376 0.2759 0.3089 0.1140 0.0924 0.0994 0.0873 0.0904 0.1156 0.0936 0.0924 0.1158 0.1354 0.1294 0.1061 0.0792 0.0925 0.1073 0.0999 0.0918 0.1016 0.0974 0.1006 0.0931 0.0811 0.0787 0.0818 0.0773
va: 2.0983 2.0374 2.0932 2.1040 3.1254 3.7022 3.7821 3.8576 3.9144 3.8817 3.8516 4.1368 3.6554 3.8988 3.9304 3.9408 3.6501 3.6800 3.9111 3.9184 3.9133 3.9136 4.1787 4.1949 1.0043 1.0264 1.0004 1.0057 1.0036 1.0020 0.9995 1.0079 1.0199 1.0022 1.0073 0.9993 1.0107 0.9949 1.0006 0.9958 1.0048 1.0057 1.0178 1.0037 1.0160 1.0099 1.0072 1.0097 1.0092
dispcorr: -0.028034274 hartree
energy: -1094.902069095178
dipole: 3.27801 -4.85911 -1.58111 22.52053 -20.39245 2.12807 11.74798 -10.55472 1.19325
magnitude: 2.90731 au
magnitude: 7.38979 debye
