program: Orca
programVersion: 5.0.2
elementType: O O O O N C C C C C C C C C C C C C C C C C C C H H H H H H H H H H H H H H H H H H H H H H H H H
charge: 0
multiplicity: 1
keywords: wb97x-d3
keywords: def2-TZVPP
keywords: def2/J RIJCOSX
keywords: DEFGRID2
keywords: scfconv7
keywords: smallprint printgap noloewdin
keywords: NOSOSCF
formula: C19H25NO4
InChI: InChI=1/C19H25NO4/c1-11(2)9-14-15(19(14,3)4)18(23)24-10-20-16(21)12-7-5-6-8-13(12)17(20)22/h9,14-15H,5-8,10H2,1-4H3
49 atoms
O  0.368493 -0.159882 0.077992
O  2.146273 -0.750112 1.285972
O  -1.512706 -2.680754 -1.219401
O  -2.675963 0.773295 1.494484
N  -1.755057 -0.99308 0.332698
C  3.73211 0.395077 -1.180443
C  3.67988 1.473494 -0.150639
C  2.389342 0.759042 -0.568367
C  3.907346 0.828097 -2.617374
C  4.384185 -0.934876 -0.892699
C  4.278922 1.332211 1.1945
C  1.67527 -0.123801 0.366121
C  4.345988 2.292539 2.122567
C  -0.449572 -0.999711 0.890739
C  5.024422 2.04134 3.436292
C  3.760091 3.663554 1.976856
C  -3.566912 -1.413783 -1.025424
C  -3.913016 -0.408176 -0.220606
C  -4.438608 -2.016634 -2.063461
C  -5.23923 0.257136 -0.210712
C  -5.645559 -1.108516 -2.304509
C  -6.240052 -0.594789 -0.993966
C  -2.175189 -1.816656 -0.706755
C  -2.758899 -0.086001 0.655876
H  3.716248 2.479779 -0.555316
H  1.731874 1.330442 -1.213401
H  3.472715 0.098067 -3.303378
H  3.436228 1.791794 -2.815152
H  4.967511 0.922065 -2.8615
H  5.455029 -0.870093 -1.095704
H  4.265285 -1.282113 0.129567
H  3.974847 -1.70501 -1.549086
H  4.732837 0.376948 1.433672
H  -0.49257 -0.623068 1.912731
H  -0.066753 -2.019551 0.903982
H  5.409076 1.024353 3.514606
H  5.860126 2.730257 3.586239
H  4.336707 2.205305 4.270466
H  2.968314 3.81935 2.715064
H  4.514743 4.430285 2.170035
H  3.331339 3.857586 0.99518
H  -3.876278 -2.174516 -2.986816
H  -4.759456 -3.009807 -1.733412
H  -5.578554 0.415133 0.815697
H  -5.147973 1.253863 -0.654148
H  -5.33844 -0.258576 -2.920034
H  -6.402331 -1.649408 -2.873784
H  -6.548153 -1.444942 -0.378738
H  -7.14012 -0.011562 -1.192614
elementType: O N C H
totalener: -1094.87873736 hartree
nucrepener: 2048.12529985 hartree
electener: -3143.00403721 hartree
oneelecener: -5558.66079499 hartree
twoeener: 2415.65675778 hartree
cpcmener: -0.03117736 hartree
kineticenergy: 1090.02567800 hartree
xcener: -105.968221833624 hartree
chargesum: -0.0000000
charge: -0.282082 -0.470281 -0.407705 -0.407731 -0.113346 0.112918 -0.022270 -0.053246 -0.256606 -0.291323 -0.255914 0.385517 -0.033522 0.088764 -0.229143 -0.258576 -0.068788 -0.076914 -0.071002 -0.073339 -0.135859 -0.134399 0.316352 0.322098 0.110932 0.092933 0.095145 0.087044 0.094184 0.102495 0.093925 0.100937 0.118221 0.131823 0.127853 0.088039 0.093945 0.093036 0.098092 0.094254 0.087654 0.093766 0.099980 0.093821 0.101086 0.077771 0.080997 0.077812 0.080657
qa: -0.2821 -0.4703 -0.4077 -0.4077 -0.1133 0.1129 -0.0223 -0.0532 -0.2566 -0.2913 -0.2559 0.3855 -0.0335 0.0888 -0.2291 -0.2586 -0.0688 -0.0769 -0.0710 -0.0733 -0.1359 -0.1344 0.3164 0.3221 0.1109 0.0929 0.0951 0.0870 0.0942 0.1025 0.0939 0.1009 0.1182 0.1318 0.1279 0.0880 0.0939 0.0930 0.0981 0.0943 0.0877 0.0938 0.1000 0.0938 0.1011 0.0778 0.0810 0.0778 0.0807
va: 2.1124 2.0210 2.1101 2.1105 3.1249 3.7848 3.7754 3.8539 3.8942 3.8974 3.8572 4.0928 3.7514 3.8920 3.9283 3.9446 3.6671 3.6760 3.9215 3.9225 3.9163 3.9134 4.2175 4.2156 1.0046 1.0280 1.0028 1.0051 1.0022 0.9989 1.0193 0.9999 1.0083 1.0030 1.0035 1.0086 0.9959 0.9961 0.9965 0.9972 1.0101 1.0153 1.0052 1.0152 1.0052 1.0071 1.0094 1.0072 1.0096
dispcorr: -0.021858214 hartree
energy: -1094.900595574448
dipole: 15.84508 -17.41720 -1.57212 11.24998 -10.59959 0.65038 -3.40626 2.10102 -1.30523
magnitude: 2.14434 au
magnitude: 5.45048 debye
