program: Orca
programVersion: 5.0.2
elementType: O O O O N C C C C C C C C C C C C C C C C C C C H H H H H H H H H H H H H H H H H H H H H H H H H
charge: 0
multiplicity: 1
keywords: wb97x-d3
keywords: def2-TZVPP
keywords: def2/J RIJCOSX
keywords: DEFGRID2
keywords: scfconv7
keywords: smallprint printgap noloewdin
keywords: NOSOSCF
formula: C19H25NO4
InChI: InChI=1/C19H25NO4/c1-11(2)9-14-15(19(14,3)4)18(23)24-10-20-16(21)12-7-5-6-8-13(12)17(20)22/h9,14-15H,5-8,10H2,1-4H3
49 atoms
O  0.774987 -0.980389 -0.828831
O  1.075643 1.226737 -0.599373
O  -2.060018 1.518677 -0.922138
O  -1.728516 -2.981188 -0.357856
N  -1.564075 -0.739488 -0.862913
C  3.060059 0.494581 1.682576
C  3.877835 0.389301 0.444072
C  2.525917 -0.325057 0.521752
C  3.49369 -0.325284 2.875756
C  2.428968 1.808428 2.071374
C  4.119824 1.550946 -0.448875
C  1.408355 0.100149 -0.3327
C  4.278538 1.481279 -1.772605
C  -0.369074 -0.794822 -1.644337
C  4.576529 2.701489 -2.588381
C  4.147896 0.208542 -2.551795
C  -3.407129 -0.046965 0.333125
C  -3.326555 -1.369124 0.48412
C  -4.445819 0.81992 0.940929
C  -4.279229 -2.201689 1.258313
C  -5.19484 0.036604 2.021211
C  -5.534172 -1.383469 1.569477
C  -2.292965 0.401819 -0.540696
C  -2.140238 -1.853664 -0.262082
H  4.703089 -0.317086 0.492242
H  2.586128 -1.399362 0.65029
H  3.960889 -1.265174 2.578338
H  4.217854 0.22692 3.47849
H  2.642834 -0.565251 3.51668
H  1.519984 1.64192 2.652737
H  3.121139 2.369518 2.702827
H  2.170189 2.442203 1.228091
H  4.211016 2.521239 0.031339
H  -0.404648 -1.662916 -2.298037
H  -0.299999 0.102455 -2.256941
H  3.806634 2.865199 -3.347227
H  4.642637 3.601104 -1.97647
H  5.521105 2.589734 -3.127463
H  4.996775 0.077054 -3.227375
H  4.081868 -0.678209 -1.923653
H  3.255085 0.236254 -3.183502
H  -3.990619 1.721488 1.358113
H  -5.133301 1.163744 0.161445
H  -4.53256 -3.10636 0.700056
H  -3.797716 -2.542757 2.180392
H  -4.579837 -0.008839 2.924549
H  -6.107052 0.570105 2.292294
H  -6.165069 -1.33837 0.677135
H  -6.118441 -1.890323 2.338839
elementType: O N C H
totalener: -1094.87656772 hartree
nucrepener: 2116.93896648 hartree
electener: -3211.81553420 hartree
oneelecener: -5696.77720167 hartree
twoeener: 2484.96166747 hartree
cpcmener: -0.03483936 hartree
kineticenergy: 1090.03930680 hartree
xcener: -105.970720396196 hartree
chargesum: 0.0000000
charge: -0.286107 -0.449749 -0.401745 -0.410576 -0.095285 0.137154 -0.018769 -0.117060 -0.263561 -0.299916 -0.275307 0.401206 -0.016237 0.069781 -0.222882 -0.265469 -0.061800 -0.083782 -0.075003 -0.071923 -0.136135 -0.135863 0.307552 0.320306 0.112768 0.095698 0.086835 0.093527 0.095365 0.099322 0.098641 0.098741 0.120117 0.138665 0.128058 0.094463 0.088811 0.094286 0.105031 0.094559 0.100130 0.093980 0.100957 0.092953 0.100989 0.077930 0.080781 0.078130 0.080434
qa: -0.2861 -0.4497 -0.4017 -0.4106 -0.0953 0.1372 -0.0188 -0.1171 -0.2636 -0.2999 -0.2753 0.4012 -0.0162 0.0698 -0.2229 -0.2655 -0.0618 -0.0838 -0.0750 -0.0719 -0.1361 -0.1359 0.3076 0.3203 0.1128 0.0957 0.0868 0.0935 0.0954 0.0993 0.0986 0.0987 0.1201 0.1387 0.1281 0.0945 0.0888 0.0943 0.1050 0.0946 0.1001 0.0940 0.1010 0.0930 0.1010 0.0779 0.0808 0.0781 0.0804
va: 2.0997 2.0425 2.1137 2.1065 3.0865 3.7302 3.8303 3.8107 3.9014 3.8969 3.8614 4.0907 3.7093 3.9099 3.9261 3.9441 3.6504 3.6868 3.9209 3.9203 3.9149 3.9139 4.2227 4.2226 1.0055 1.0300 1.0046 1.0023 1.0024 1.0011 0.9981 1.0145 1.0016 1.0009 1.0195 0.9963 1.0072 0.9969 1.0000 1.0055 0.9979 1.0155 1.0050 1.0154 1.0051 1.0066 1.0095 1.0065 1.0097
dispcorr: -0.023864359 hartree
energy: -1094.900432075694
dipole: 13.62223 -14.38508 -0.76286 7.02431 -7.78603 -0.76172 7.89934 -6.99440 0.90493
magnitude: 1.40751 au
magnitude: 3.57759 debye
