program: Orca
programVersion: 5.0.2
elementType: O O O O N C C C C C C C C C C C C C C C C C C C H H H H H H H H H H H H H H H H H H H H H H H H H
charge: 0
multiplicity: 1
keywords: wb97x-d3
keywords: def2-TZVPP
keywords: def2/J RIJCOSX
keywords: DEFGRID2
keywords: scfconv7
keywords: smallprint printgap noloewdin
keywords: NOSOSCF
formula: C19H25NO4
InChI: InChI=1/C19H25NO4/c1-11(2)9-14-15(19(14,3)4)18(23)24-10-20-16(21)12-7-5-6-8-13(12)17(20)22/h9,14-15H,5-8,10H2,1-4H3
49 atoms
O  1.039915 -1.243822 -0.416034
O  2.501021 -2.536607 -1.48027
O  -1.383234 0.408024 -1.973931
O  -1.685144 -2.771037 1.258073
N  -1.243609 -1.383525 -0.530763
C  3.314292 0.03796 1.096623
C  3.358984 0.78559 -0.202506
C  3.348617 -0.744788 -0.20055
C  4.5947 -0.028236 1.897507
C  2.08723 0.113329 1.972784
C  2.228396 1.594868 -0.709032
C  2.276505 -1.590071 -0.760902
C  2.271079 2.908392 -0.955811
C  -0.039737 -1.96901 -1.004288
C  1.068896 3.622071 -1.497502
C  3.475103 3.776016 -0.743934
C  -2.975883 0.092923 -0.176062
C  -3.068875 -0.845298 0.767495
C  -3.89422 1.248434 -0.32464
C  -4.122897 -0.905592 1.809618
C  -4.730412 1.399161 0.947301
C  -5.25755 0.053296 1.44383
C  -1.801679 -0.211815 -1.029895
C  -1.951347 -1.806012 0.590887
H  4.337734 1.175082 -0.462809
H  4.312494 -1.182506 -0.433976
H  4.699886 0.856561 2.528755
H  4.601931 -0.903842 2.550403
H  5.476451 -0.085319 1.257903
H  1.169795 0.34438 1.439331
H  1.934635 -0.819857 2.518335
H  2.231678 0.902375 2.71369
H  1.291736 1.087853 -0.902663
H  -0.010532 -3.017274 -0.709248
H  0.000958 -1.902161 -2.091317
H  0.235573 2.944691 -1.685639
H  0.725053 4.394832 -0.804567
H  1.304016 4.133083 -2.435318
H  4.244187 3.314427 -0.126809
H  3.933483 4.047219 -1.699498
H  3.190532 4.715038 -0.263356
H  -3.328008 2.159825 -0.532039
H  -4.53793 1.089237 -1.195923
H  -4.494416 -1.927706 1.915984
H  -3.687983 -0.641804 2.779221
H  -4.11708 1.857984 1.728338
H  -5.560832 2.081639 0.761132
H  -5.876048 -0.401817 0.66484
H  -5.904637 0.199775 2.309758
elementType: O N C H
totalener: -1094.87505047 hartree
nucrepener: 2143.29792536 hartree
electener: -3238.17297583 hartree
oneelecener: -5748.33733781 hartree
twoeener: 2510.16436198 hartree
cpcmener: -0.03083417 hartree
kineticenergy: 1090.02339874 hartree
xcener: -105.967808954248 hartree
chargesum: 0.0000000
charge: -0.261977 -0.466433 -0.412095 -0.406691 -0.095131 0.158961 0.000754 -0.137288 -0.271037 -0.271408 -0.295825 0.401935 0.004687 0.063923 -0.225912 -0.270113 -0.054630 -0.070092 -0.073908 -0.072097 -0.134424 -0.137060 0.305026 0.313091 0.110474 0.097313 0.092285 0.094910 0.088357 0.086584 0.104658 0.094234 0.105121 0.130579 0.139201 0.081113 0.092710 0.093745 0.091151 0.102864 0.093543 0.093838 0.100874 0.093915 0.101627 0.078506 0.080626 0.078479 0.081035
qa: -0.2620 -0.4664 -0.4121 -0.4067 -0.0951 0.1590 0.0008 -0.1373 -0.2710 -0.2714 -0.2958 0.4019 0.0047 0.0639 -0.2259 -0.2701 -0.0546 -0.0701 -0.0739 -0.0721 -0.1344 -0.1371 0.3050 0.3131 0.1105 0.0973 0.0923 0.0949 0.0884 0.0866 0.1047 0.0942 0.1051 0.1306 0.1392 0.0811 0.0927 0.0937 0.0912 0.1029 0.0935 0.0938 0.1009 0.0939 0.1016 0.0785 0.0806 0.0785 0.0810
va: 2.1118 2.0395 2.0930 2.1103 3.1327 3.6591 3.7457 3.9280 3.9143 3.9044 3.8955 4.1247 3.6871 3.9006 3.9272 3.9422 3.6708 3.6804 3.9220 3.9186 3.9141 3.9162 4.1908 4.2054 1.0041 1.0256 1.0026 1.0016 1.0050 1.0080 1.0024 1.0023 1.0093 1.0065 0.9995 1.0142 0.9966 0.9953 1.0062 0.9946 0.9984 1.0150 1.0049 1.0155 1.0052 1.0068 1.0097 1.0066 1.0096
dispcorr: -0.024623296 hartree
energy: -1094.899673765803
dipole: 5.89483 -7.45048 -1.55565 22.99745 -21.12002 1.87743 9.47648 -8.20168 1.27481
magnitude: 2.75135 au
magnitude: 6.99338 debye
