program: Orca
programVersion: 5.0.2
elementType: O O O O N C C C C C C C C C C C C C C C C C C C H H H H H H H H H H H H H H H H H H H H H H H H H
charge: 0
multiplicity: 1
keywords: wb97x-d3
keywords: def2-TZVPP
keywords: def2/J RIJCOSX
keywords: DEFGRID2
keywords: scfconv7
keywords: smallprint printgap noloewdin
keywords: NOSOSCF
formula: C19H25NO4
InChI: InChI=1/C19H25NO4/c1-11(2)9-14-15(19(14,3)4)18(23)24-10-20-16(21)12-7-5-6-8-13(12)17(20)22/h9,14-15H,5-8,10H2,1-4H3
49 atoms
O  0.806774 -1.400243 0.371821
O  2.044824 -0.130044 1.742911
O  -1.338619 1.075443 1.11103
O  -2.189151 -3.248752 0.016366
N  -1.465241 -1.201101 0.791122
C  4.252936 -0.438059 -0.43841
C  3.500212 0.802293 -0.768619
C  2.737405 -0.504502 -0.52105
C  4.967738 -1.133916 -1.573606
C  4.970858 -0.58814 0.879429
C  3.404162 1.957726 0.157595
C  1.872627 -0.630688 0.659846
C  2.471651 2.911232 0.088537
C  -0.209714 -1.574406 1.349795
C  2.462465 4.066206 1.042468
C  1.352262 2.904004 -0.90539
C  -3.198599 0.052976 -0.061748
C  -3.443109 -1.217334 -0.387027
C  -4.079092 1.201665 -0.389009
C  -4.625206 -1.692057 -1.14711
C  -5.448623 0.682493 -0.830597
C  -5.326866 -0.497539 -1.794971
C  -1.913098 0.109335 0.678062
C  -2.335298 -2.059469 0.129071
H  3.496634 1.070073 -1.821746
H  2.343295 -0.989847 -1.406272
H  5.971404 -0.723852 -1.703588
H  5.069551 -2.20296 -1.375794
H  4.439546 -1.019762 -2.521096
H  5.044739 -1.64214 1.154328
H  5.988578 -0.204054 0.78607
H  4.499944 -0.065935 1.706976
H  4.163399 2.036191 0.929733
H  -0.015037 -0.981479 2.240704
H  -0.243699 -2.626374 1.626542
H  1.522028 4.105876 1.598741
H  3.277409 4.012657 1.764313
H  2.545675 5.017734 0.510114
H  0.389699 2.817021 -0.393778
H  1.319659 3.843713 -1.46303
H  1.415265 2.089593 -1.625573
H  -4.171121 1.868906 0.471387
H  -3.61563 1.796666 -1.183006
H  -4.323939 -2.425575 -1.898862
H  -5.303661 -2.218916 -0.468192
H  -6.016238 0.371176 0.050817
H  -6.013698 1.490967 -1.296006
H  -4.763323 -0.185804 -2.67904
H  -6.314792 -0.799969 -2.144791
elementType: O N C H
totalener: -1094.87670426 hartree
nucrepener: 2119.77472583 hartree
electener: -3214.65143008 hartree
oneelecener: -5702.33600488 hartree
twoeener: 2487.68457480 hartree
cpcmener: -0.03168069 hartree
kineticenergy: 1090.04307625 hartree
xcener: -105.971893639874 hartree
chargesum: 0.0000000
charge: -0.287830 -0.453207 -0.415560 -0.409159 -0.098628 0.136536 -0.035403 -0.106534 -0.260719 -0.299450 -0.246888 0.400767 -0.020868 0.080982 -0.228063 -0.269059 -0.061068 -0.080019 -0.073151 -0.071259 -0.135421 -0.135206 0.322622 0.320974 0.111610 0.092837 0.094008 0.095801 0.086437 0.100666 0.100063 0.094285 0.120515 0.133380 0.125804 0.094670 0.088500 0.093696 0.092595 0.104445 0.090223 0.093667 0.101300 0.093103 0.100366 0.078007 0.081350 0.078181 0.080100
qa: -0.2878 -0.4532 -0.4156 -0.4092 -0.0986 0.1365 -0.0354 -0.1065 -0.2607 -0.2994 -0.2469 0.4008 -0.0209 0.0810 -0.2281 -0.2691 -0.0611 -0.0800 -0.0732 -0.0713 -0.1354 -0.1352 0.3226 0.3210 0.1116 0.0928 0.0940 0.0958 0.0864 0.1007 0.1001 0.0943 0.1205 0.1334 0.1258 0.0947 0.0885 0.0937 0.0926 0.1044 0.0902 0.0937 0.1013 0.0931 0.1004 0.0780 0.0814 0.0782 0.0801
va: 2.1071 2.0421 2.0903 2.1080 3.1056 3.7489 3.8215 3.8373 3.8973 3.8992 3.8421 4.0997 3.7173 3.8733 3.9287 3.9424 3.6612 3.6896 3.9197 3.9183 3.9136 3.9160 4.1979 4.2230 1.0042 1.0304 1.0024 1.0023 1.0046 1.0002 0.9981 1.0167 1.0008 1.0226 1.0094 0.9965 1.0074 0.9967 1.0052 1.0009 1.0064 1.0156 1.0052 1.0157 1.0048 1.0069 1.0097 1.0067 1.0097
dispcorr: -0.023829976 hartree
energy: -1094.900534231387
dipole: 10.27997 -11.73064 -1.45066 14.13721 -13.89364 0.24357 -9.07026 7.54892 -1.52133
magnitude: 2.11618 au
magnitude: 5.37890 debye
