program: Orca
programVersion: 5.0.2
elementType: O O O O N C C C C C C C C C C C C C C C C C C C H H H H H H H H H H H H H H H H H H H H H H H H H
charge: 0
multiplicity: 1
keywords: wb97x-d3
keywords: def2-TZVPP
keywords: def2/J RIJCOSX
keywords: DEFGRID2
keywords: scfconv7
keywords: smallprint printgap noloewdin
keywords: NOSOSCF
formula: C19H25NO4
InChI: InChI=1/C19H25NO4/c1-11(2)9-14-15(19(14,3)4)18(23)24-10-20-16(21)12-7-5-6-8-13(12)17(20)22/h9,14-15H,5-8,10H2,1-4H3
49 atoms
O  0.858315 -1.257276 -0.608988
O  2.050737 -1.17237 1.287428
O  -2.088826 -2.618428 -2.137595
O  -1.366934 0.12164 1.411658
N  -1.42082 -1.468663 -0.252141
C  4.243415 0.125323 -0.527392
C  3.462554 1.245239 0.063759
C  2.727255 0.094248 -0.633497
C  4.957786 0.39799 -1.83101
C  4.981217 -0.856437 0.34774
C  3.36965 1.482842 1.525063
C  1.886213 -0.826875 0.143801
C  2.429978 2.224565 2.117221
C  -0.149166 -2.067246 -0.018922
C  2.43107 2.449071 3.598509
C  1.296312 2.866271 1.379179
C  -3.418425 -0.825265 -1.198932
C  -3.211722 -0.024221 -0.152574
C  -4.601073 -0.774378 -2.092555
C  -4.1378 1.040222 0.304309
C  -5.365548 0.529527 -1.855297
C  -5.499735 0.853851 -0.367794
C  -2.271869 -1.762554 -1.311189
C  -1.915557 -0.389742 0.469322
H  3.435593 2.148873 -0.539173
H  2.330748 0.325888 -1.615072
H  5.946948 0.820881 -1.643288
H  5.09388 -0.520852 -2.404966
H  4.410776 1.104244 -2.457141
H  5.988161 -0.483161 0.545954
H  4.508089 -1.042664 1.307753
H  5.084431 -1.816669 -0.161359
H  4.14027 1.038672 2.147744
H  0.009703 -2.188746 1.050633
H  -0.127715 -3.047082 -0.492475
H  3.255924 1.93578 4.092942
H  2.505511 3.513611 3.836988
H  1.498286 2.097611 4.047801
H  0.341041 2.448616 1.708035
H  1.250734 3.937972 1.589315
H  1.354943 2.739633 0.299468
H  -4.29364 -0.862259 -3.137384
H  -5.23975 -1.641062 -1.893299
H  -4.232986 1.020149 1.392596
H  -3.713516 2.019087 0.05793
H  -4.843122 1.348461 -2.358106
H  -6.353204 0.461519 -2.313595
H  -6.038896 0.043979 0.132027
H  -6.098763 1.755835 -0.234338
elementType: O N C H
totalener: -1094.87669151 hartree
nucrepener: 2114.70358203 hartree
electener: -3209.58027355 hartree
oneelecener: -5692.21555353 hartree
twoeener: 2482.63527998 hartree
cpcmener: -0.03176296 hartree
kineticenergy: 1090.03653584 hartree
xcener: -105.970652112280 hartree
chargesum: -0.0000000
charge: -0.287282 -0.454719 -0.409303 -0.417152 -0.097661 0.137637 -0.035036 -0.107439 -0.260328 -0.299687 -0.251408 0.401071 -0.018499 0.078326 -0.227863 -0.270101 -0.082397 -0.060475 -0.070192 -0.073458 -0.135851 -0.135386 0.322032 0.325179 0.111232 0.093866 0.094504 0.095312 0.086445 0.100382 0.094139 0.101026 0.121703 0.136260 0.124611 0.087921 0.093896 0.094615 0.093501 0.104193 0.090262 0.093462 0.100378 0.093449 0.101492 0.077701 0.080853 0.077760 0.081027
qa: -0.2873 -0.4547 -0.4093 -0.4172 -0.0977 0.1376 -0.0350 -0.1074 -0.2603 -0.2997 -0.2514 0.4011 -0.0185 0.0783 -0.2279 -0.2701 -0.0824 -0.0605 -0.0702 -0.0735 -0.1359 -0.1354 0.3220 0.3252 0.1112 0.0939 0.0945 0.0953 0.0864 0.1004 0.0941 0.1010 0.1217 0.1363 0.1246 0.0879 0.0939 0.0946 0.0935 0.1042 0.0903 0.0935 0.1004 0.0934 0.1015 0.0777 0.0809 0.0778 0.0810
va: 2.1062 2.0398 2.1086 2.0892 3.1040 3.7511 3.8193 3.8395 3.8973 3.9003 3.8441 4.0994 3.7156 3.8719 3.9287 3.9422 3.6935 3.6582 3.9188 3.9194 3.9169 3.9142 4.2241 4.1964 1.0043 1.0305 1.0021 1.0027 1.0047 0.9982 1.0164 1.0001 1.0002 1.0198 1.0108 1.0074 0.9966 0.9964 1.0050 1.0007 1.0061 1.0155 1.0049 1.0157 1.0050 1.0066 1.0095 1.0069 1.0096
dispcorr: -0.023689209 hartree
energy: -1094.900380722933
dipole: 9.83330 -11.31512 -1.48182 16.91368 -15.78463 1.12906 2.90117 -3.92326 -1.02209
magnitude: 2.12491 au
magnitude: 5.40109 debye
