program: Orca
programVersion: 5.0.2
elementType: O O O O N C C C C C C C C C C C C C C C C C C C H H H H H H H H H H H H H H H H H H H H H H H H H
charge: 0
multiplicity: 1
keywords: wb97x-d3
keywords: def2-TZVPP
keywords: def2/J RIJCOSX
keywords: DEFGRID2
keywords: scfconv7
keywords: smallprint printgap noloewdin
keywords: NOSOSCF
formula: C19H25NO4
InChI: InChI=1/C19H25NO4/c1-11(2)9-14-15(19(14,3)4)18(23)24-10-20-16(21)12-7-5-6-8-13(12)17(20)22/h9,14-15H,5-8,10H2,1-4H3
49 atoms
O  0.781111 -1.263308 0.35911
O  2.125699 -0.176194 1.784428
O  -1.413781 1.183514 0.927711
O  -2.202793 -3.22036 0.141535
N  -1.492289 -1.110711 0.746666
C  4.28668 -0.461702 -0.441851
C  3.56732 0.802113 -0.756043
C  2.769617 -0.483448 -0.507139
C  4.964131 -1.176031 -1.588481
C  5.020291 -0.63241 0.864952
C  3.51645 1.956664 0.174896
C  1.907073 -0.600304 0.676678
C  2.587559 2.915651 0.136125
C  -0.235491 -1.418498 1.340532
C  2.614031 4.071891 1.087872
C  1.430095 2.899392 -0.813948
C  -3.267789 0.052784 -0.145727
C  -3.501286 -1.240847 -0.370777
C  -4.16449 1.16581 -0.540836
C  -4.696363 -1.783809 -1.061221
C  -5.537481 0.608389 -0.921191
C  -5.431079 -0.650939 -1.781294
C  -1.971158 0.180023 0.562782
C  -2.365421 -2.028228 0.17349
H  3.555999 1.075628 -1.807892
H  2.353539 -0.944687 -1.395119
H  4.431124 -1.034862 -2.529725
H  5.981866 -0.805012 -1.72611
H  5.025278 -2.249654 -1.398783
H  5.056352 -1.685766 1.149598
H  6.051176 -0.291478 0.748442
H  4.587702 -0.082373 1.695589
H  4.306196 2.031787 0.916179
H  -0.067668 -0.768773 2.197015
H  -0.245882 -2.453409 1.679345
H  2.633183 5.023388 0.549779
H  1.714051 4.087548 1.708968
H  3.478541 4.04246 1.751344
H  1.535692 2.167171 -1.61309
H  0.503488 2.66979 -0.28102
H  1.286064 3.880072 -1.273474
H  -4.248989 1.89339 0.270003
H  -3.7169 1.705292 -1.382078
H  -4.406916 -2.56937 -1.763307
H  -5.349698 -2.264392 -0.325692
H  -6.097758 0.379498 -0.010266
H  -6.105936 1.373273 -1.452155
H  -4.902562 -0.412369 -2.708618
H  -6.427707 -0.989329 -2.068513
elementType: O N C H
totalener: -1094.87645516 hartree
nucrepener: 2112.10516698 hartree
electener: -3206.98162214 hartree
oneelecener: -5686.90808440 hartree
twoeener: 2479.92646227 hartree
cpcmener: -0.03085774 hartree
kineticenergy: 1090.03760049 hartree
xcener: -105.970830642754 hartree
chargesum: -0.0000000
charge: -0.286194 -0.455739 -0.419376 -0.408638 -0.095548 0.138545 -0.034217 -0.103339 -0.260903 -0.300235 -0.257545 0.399695 -0.015897 0.077507 -0.225267 -0.276755 -0.058177 -0.084746 -0.071862 -0.070990 -0.134707 -0.136656 0.324783 0.322248 0.110906 0.091941 0.086215 0.093535 0.095983 0.100897 0.099463 0.094598 0.121261 0.133543 0.127532 0.093017 0.095432 0.088165 0.092350 0.099774 0.103521 0.093015 0.101411 0.093319 0.100699 0.077646 0.080773 0.078717 0.080301
qa: -0.2862 -0.4557 -0.4194 -0.4086 -0.0955 0.1385 -0.0342 -0.1033 -0.2609 -0.3002 -0.2575 0.3997 -0.0159 0.0775 -0.2253 -0.2768 -0.0582 -0.0847 -0.0719 -0.0710 -0.1347 -0.1367 0.3248 0.3222 0.1109 0.0919 0.0862 0.0935 0.0960 0.1009 0.0995 0.0946 0.1213 0.1335 0.1275 0.0930 0.0954 0.0882 0.0923 0.0998 0.1035 0.0930 0.1014 0.0933 0.1007 0.0776 0.0808 0.0787 0.0803
va: 2.1032 2.0393 2.0861 2.1085 3.1042 3.7455 3.8211 3.8419 3.8979 3.8984 3.8456 4.0953 3.7160 3.8714 3.9282 3.9449 3.6655 3.6986 3.9196 3.9184 3.9158 3.9169 4.1902 4.2217 1.0048 1.0310 1.0046 1.0026 1.0023 1.0001 0.9983 1.0165 1.0008 1.0195 1.0082 0.9975 0.9955 1.0075 1.0052 1.0034 1.0021 1.0159 1.0047 1.0156 1.0045 1.0066 1.0097 1.0063 1.0096
dispcorr: -0.023763430 hartree
energy: -1094.900218587407
dipole: 10.47079 -12.00553 -1.53474 13.37405 -13.13363 0.24042 -8.86463 7.32879 -1.53584
magnitude: 2.18450 au
magnitude: 5.55255 debye
