program: Orca
programVersion: 5.0.2
elementType: O O O O N C C C C C C C C C C C C C C C C C C C H H H H H H H H H H H H H H H H H H H H H H H H H
charge: 0
multiplicity: 1
keywords: wb97x-d3
keywords: def2-TZVPP
keywords: def2/J RIJCOSX
keywords: DEFGRID2
keywords: scfconv7
keywords: smallprint printgap noloewdin
keywords: NOSOSCF
formula: C19H25NO4
InChI: InChI=1/C19H25NO4/c1-11(2)9-14-15(19(14,3)4)18(23)24-10-20-16(21)12-7-5-6-8-13(12)17(20)22/h9,14-15H,5-8,10H2,1-4H3
49 atoms
O  1.195581 -2.037435 -1.059043
O  1.31922 -1.615575 1.130111
O  -1.69026 -2.354275 1.544305
O  -1.009098 -0.474187 -2.539702
N  -1.081912 -1.692685 -0.585587
C  3.877312 0.016679 0.554206
C  2.881441 0.845399 -0.204343
C  2.936124 -0.681772 -0.389524
C  5.306432 0.084555 0.065234
C  3.790893 -0.136576 2.053982
C  1.713748 1.489362 0.42381
C  1.769172 -1.481627 0.019954
C  1.146205 2.641235 0.04604
C  -0.071448 -2.654434 -0.897118
C  -0.055196 3.167098 0.774465
C  1.602994 3.501181 -1.093503
C  -2.596167 -0.359327 0.523716
C  -2.410328 0.188063 -0.677863
C  -3.50547 0.165829 1.570842
C  -3.096923 1.404706 -1.176767
C  -3.923975 1.592851 1.213358
C  -4.282248 1.730914 -0.265952
C  -1.760126 -1.582481 0.624238
C  -1.433075 -0.642083 -1.42499
H  3.288028 1.370957 -1.060521
H  3.357168 -0.993477 -1.338922
H  5.854469 -0.820509 0.336085
H  5.365002 0.194025 -1.018768
H  5.826454 0.933939 0.512615
H  2.787571 -0.055464 2.460156
H  4.19729 -1.100201 2.36649
H  4.396315 0.639795 2.526184
H  1.265213 0.979788 1.26932
H  -0.061956 -3.419916 -0.121391
H  -0.277983 -3.127492 -1.854439
H  -0.420969 2.469707 1.528617
H  0.169167 4.115874 1.270081
H  -0.873641 3.373536 0.079941
H  1.665645 4.547011 -0.78219
H  2.573588 3.222545 -1.499489
H  0.879764 3.467586 -1.913548
H  -4.380286 -0.48802 1.649748
H  -3.019387 0.134143 2.548979
H  -2.385339 2.236324 -1.201674
H  -3.425579 1.260898 -2.208835
H  -4.771415 1.890468 1.832699
H  -3.105813 2.278109 1.453706
H  -4.633799 2.742861 -0.472226
H  -5.111769 1.057916 -0.501351
elementType: O N C H
totalener: -1094.87509200 hartree
nucrepener: 2218.90643873 hartree
electener: -3313.78153073 hartree
oneelecener: -5900.39834399 hartree
twoeener: 2586.61681326 hartree
cpcmener: -0.03342636 hartree
kineticenergy: 1090.03720602 hartree
xcener: -105.972374755127 hartree
chargesum: 0.0000000
charge: -0.278209 -0.443335 -0.401892 -0.408716 -0.097079 0.113614 0.051184 -0.107706 -0.265493 -0.277180 -0.314555 0.384103 -0.043779 0.079148 -0.241615 -0.258227 -0.054577 -0.087136 -0.070109 -0.112716 -0.153481 -0.118972 0.308095 0.315806 0.113192 0.099957 0.094050 0.086785 0.095418 0.093776 0.100031 0.092524 0.122131 0.131018 0.143409 0.088189 0.111333 0.090343 0.095340 0.090714 0.099948 0.103763 0.094856 0.112416 0.100481 0.084448 0.080081 0.080113 0.078509
qa: -0.2782 -0.4433 -0.4019 -0.4087 -0.0971 0.1136 0.0512 -0.1077 -0.2655 -0.2772 -0.3146 0.3841 -0.0438 0.0791 -0.2416 -0.2582 -0.0546 -0.0871 -0.0701 -0.1127 -0.1535 -0.1190 0.3081 0.3158 0.1132 0.1000 0.0941 0.0868 0.0954 0.0938 0.1000 0.0925 0.1221 0.1310 0.1434 0.0882 0.1113 0.0903 0.0953 0.0907 0.0999 0.1038 0.0949 0.1124 0.1005 0.0844 0.0801 0.0801 0.0785
va: 2.1113 2.0614 2.1142 2.1053 3.0676 3.7254 3.7403 3.8258 3.9048 3.8937 3.8616 4.1630 3.7551 3.9004 3.9246 3.9388 3.6228 3.6455 3.9001 3.9357 3.9213 3.8918 4.2169 4.1918 1.0028 1.0270 1.0025 1.0046 1.0020 1.0131 1.0004 1.0014 1.0135 1.0163 0.9936 1.0071 0.9989 0.9913 0.9972 1.0124 0.9966 1.0044 1.0157 0.9965 1.0180 1.0118 1.0093 1.0109 1.0072
dispcorr: -0.027109492 hartree
energy: -1094.902201491725
dipole: 7.60234 -8.19023 -0.58790 24.33987 -22.73588 1.60400 5.21134 -5.76228 -0.55094
magnitude: 1.79498 au
magnitude: 4.56249 debye
