program: Orca
programVersion: 5.0.2
elementType: O O O O N C C C C C C C C C C C C C C C C C C C H H H H H H H H H H H H H H H H H H H H H H H H H
charge: 0
multiplicity: 1
keywords: wb97x-d3
keywords: def2-TZVPP
keywords: def2/J RIJCOSX
keywords: DEFGRID2
keywords: scfconv7
keywords: smallprint printgap noloewdin
keywords: NOSOSCF
formula: C19H25NO4
InChI: InChI=1/C19H25NO4/c1-11(2)9-14-15(19(14,3)4)18(23)24-10-20-16(21)12-7-5-6-8-13(12)17(20)22/h9,14-15H,5-8,10H2,1-4H3
49 atoms
O  0.778096 -1.044917 -0.456629
O  2.212742 -1.211188 1.251398
O  -2.062694 -2.718183 -1.848112
O  -1.554917 0.403102 1.413078
N  -1.479053 -1.330838 -0.099922
C  4.266197 0.141609 -0.646276
C  3.55234 1.263989 0.019915
C  2.747028 0.14504 -0.653889
C  4.89954 0.431826 -1.98765
C  5.045725 -0.871262 0.155008
C  3.549576 1.465093 1.489617
C  1.932479 -0.763306 0.166106
C  2.628575 2.167498 2.154303
C  -0.190212 -1.837548 0.222659
C  2.702432 2.346259 3.639421
C  1.435428 2.787053 1.495094
C  -3.48551 -0.890771 -1.139968
C  -3.332537 0.033067 -0.189845
C  -4.661244 -1.002551 -2.03805
C  -4.296804 1.11884 0.110916
C  -5.801309 -0.139065 -1.493911
C  -5.310114 1.231549 -1.029746
C  -2.296438 -1.780896 -1.1302
C  -2.045178 -0.214482 0.502813
H  3.506292 2.183142 -0.558386
H  2.289125 0.413631 -1.598671
H  5.906745 0.832628 -1.855262
H  4.98117 -0.475841 -2.589122
H  4.327445 1.161526 -2.562392
H  5.083417 -1.827002 -0.371301
H  6.074465 -0.524651 0.273878
H  4.647858 -1.058006 1.148051
H  4.367272 1.024645 2.052168
H  -0.045564 -1.805659 1.301084
H  -0.114712 -2.871126 -0.112902
H  1.805909 1.950358 4.124574
H  3.567858 1.844739 4.072851
H  2.755447 3.404848 3.908023
H  0.528041 2.232407 1.749959
H  1.279959 3.810049 1.84624
H  1.506489 2.813734 0.408663
H  -4.378518 -0.683264 -3.04653
H  -4.97162 -2.046164 -2.130235
H  -4.800767 0.902117 1.058555
H  -3.769817 2.064275 0.261357
H  -6.569322 -0.022698 -2.259897
H  -6.273891 -0.656496 -0.653939
H  -6.154468 1.843193 -0.708709
H  -4.847901 1.755024 -1.871694
elementType: O N C H
totalener: -1094.87667016 hartree
nucrepener: 2105.65981241 hartree
electener: -3200.53648257 hartree
oneelecener: -5673.94578387 hartree
twoeener: 2473.40930130 hartree
cpcmener: -0.03047078 hartree
kineticenergy: 1090.03807400 hartree
xcener: -105.970578357099 hartree
chargesum: -0.0000000
charge: -0.284819 -0.460432 -0.408792 -0.420147 -0.099321 0.138701 -0.034731 -0.099700 -0.260835 -0.300376 -0.258012 0.398015 -0.014261 0.080240 -0.225504 -0.276771 -0.086914 -0.051265 -0.072319 -0.070949 -0.134111 -0.136568 0.325683 0.317779 0.110480 0.093129 0.094152 0.095434 0.085946 0.100672 0.099198 0.095224 0.121093 0.131010 0.129793 0.094740 0.088076 0.093948 0.099924 0.103646 0.093156 0.100635 0.093362 0.100704 0.093865 0.080557 0.077460 0.081085 0.078121
qa: -0.2848 -0.4604 -0.4088 -0.4201 -0.0993 0.1387 -0.0347 -0.0997 -0.2608 -0.3004 -0.2580 0.3980 -0.0143 0.0802 -0.2255 -0.2768 -0.0869 -0.0513 -0.0723 -0.0709 -0.1341 -0.1366 0.3257 0.3178 0.1105 0.0931 0.0942 0.0954 0.0859 0.1007 0.0992 0.0952 0.1211 0.1310 0.1298 0.0947 0.0881 0.0939 0.0999 0.1036 0.0932 0.1006 0.0934 0.1007 0.0939 0.0806 0.0775 0.0811 0.0781
va: 2.1041 2.0303 2.1080 2.0862 3.1082 3.7475 3.8202 3.8535 3.8984 3.8968 3.8454 4.0873 3.7124 3.8763 3.9288 3.9466 3.7014 3.6653 3.9218 3.9185 3.9130 3.9160 4.2175 4.1938 1.0054 1.0298 1.0023 1.0025 1.0047 1.0002 0.9984 1.0169 1.0009 1.0160 1.0062 0.9956 1.0074 0.9972 1.0031 1.0014 1.0050 1.0053 1.0155 1.0053 1.0153 1.0098 1.0070 1.0095 1.0067
dispcorr: -0.023596883 hartree
energy: -1094.900267043812
dipole: 10.29613 -11.90503 -1.60889 15.73379 -14.59258 1.14122 1.63193 -2.70554 -1.07361
magnitude: 2.24579 au
magnitude: 5.70833 debye
