program: Orca
programVersion: 5.0.2
elementType: O O O O N C C C C C C C C C C C C C C C C C C C H H H H H H H H H H H H H H H H H H H H H H H H H
charge: 0
multiplicity: 1
keywords: wb97x-d3
keywords: def2-TZVPP
keywords: def2/J RIJCOSX
keywords: DEFGRID2
keywords: scfconv7
keywords: smallprint printgap noloewdin
keywords: NOSOSCF
formula: C19H25NO4
InChI: InChI=1/C19H25NO4/c1-11(2)9-14-15(19(14,3)4)18(23)24-10-20-16(21)12-7-5-6-8-13(12)17(20)22/h9,14-15H,5-8,10H2,1-4H3
49 atoms
O  0.688762 -0.7718 -0.245909
O  2.29897 -1.256876 1.218943
O  -1.852872 -2.549569 -1.700237
O  -1.862928 0.607144 1.566976
N  -1.545042 -1.147942 0.104801
C  4.26407 0.135331 -0.733097
C  3.620767 1.276285 -0.025094
C  2.750812 0.181984 -0.65433
C  4.822561 0.409004 -2.110566
C  5.067368 -0.89237 0.025401
C  3.702645 1.462429 1.445504
C  1.943948 -0.689187 0.213942
C  2.764849 2.059924 2.185045
C  -0.242378 -1.545045 0.507344
C  2.934554 2.250491 3.660713
C  1.473021 2.567069 1.622508
C  -3.474324 -0.848619 -1.116018
C  -3.471424 0.084814 -0.163463
C  -4.553615 -1.044947 -2.113635
C  -4.531671 1.100643 0.042406
C  -5.79415 -0.259295 -1.682766
C  -5.443608 1.142294 -1.185036
C  -2.228306 -1.646412 -0.999027
C  -2.23115 -0.061182 0.635571
H  3.568925 2.201794 -0.593157
H  2.245368 0.473613 -1.56763
H  5.845893 0.784186 -2.042076
H  4.842855 -0.500849 -2.713972
H  4.234255 1.152332 -2.650604
H  5.033552 -1.858137 -0.48255
H  6.113151 -0.579215 0.058591
H  4.74018 -1.046979 1.049274
H  4.604235 1.109558 1.93798
H  -0.129342 -1.371966 1.576663
H  -0.103656 -2.607122 0.304388
H  2.916255 3.311217 3.925569
H  2.114509 1.781864 4.21143
H  3.870557 1.828439 4.026559
H  0.628071 2.012601 2.039867
H  1.31584 3.614293 1.894629
H  1.413693 2.493547 0.53807
H  -4.202961 -0.712647 -3.096154
H  -4.782609 -2.108016 -2.221014
H  -5.101827 0.850789 0.943161
H  -4.086172 2.080409 0.231776
H  -6.493337 -0.195059 -2.517634
H  -6.307134 -0.807021 -0.886909
H  -6.354119 1.69287 -0.944401
H  -4.945271 1.697095 -1.985223
elementType: O N C H
totalener: -1094.87721595 hartree
nucrepener: 2104.66756316 hartree
electener: -3199.54477911 hartree
oneelecener: -5671.81861018 hartree
twoeener: 2472.27383106 hartree
cpcmener: -0.03026436 hartree
kineticenergy: 1090.04515461 hartree
xcener: -105.971126573667 hartree
chargesum: 0.0000000
charge: -0.278830 -0.461627 -0.407616 -0.417796 -0.109699 0.142765 -0.023497 -0.100453 -0.263832 -0.299102 -0.280825 0.389132 -0.003903 0.079469 -0.223437 -0.269690 -0.083630 -0.047204 -0.073287 -0.070315 -0.134868 -0.136418 0.323805 0.312182 0.111381 0.095232 0.093621 0.095627 0.085764 0.100253 0.097427 0.096111 0.120311 0.126099 0.138106 0.094944 0.094447 0.088650 0.093762 0.107037 0.092468 0.101045 0.093998 0.100807 0.093728 0.081242 0.077541 0.080842 0.078232
qa: -0.2788 -0.4616 -0.4076 -0.4178 -0.1097 0.1428 -0.0235 -0.1005 -0.2638 -0.2991 -0.2808 0.3891 -0.0039 0.0795 -0.2234 -0.2697 -0.0836 -0.0472 -0.0733 -0.0703 -0.1349 -0.1364 0.3238 0.3122 0.1114 0.0952 0.0936 0.0956 0.0858 0.1003 0.0974 0.0961 0.1203 0.1261 0.1381 0.0949 0.0944 0.0887 0.0938 0.1070 0.0925 0.1010 0.0940 0.1008 0.0937 0.0812 0.0775 0.0808 0.0782
va: 2.0984 2.0260 2.1094 2.0944 3.1179 3.7334 3.8277 3.8455 3.9007 3.8931 3.8651 4.0908 3.6968 3.8965 3.9261 3.9455 3.6992 3.6756 3.9211 3.9171 3.9130 3.9170 4.2131 4.1923 1.0062 1.0280 1.0025 1.0023 1.0046 1.0010 0.9985 1.0157 1.0024 1.0092 0.9999 0.9967 0.9966 1.0071 1.0075 1.0004 1.0065 1.0053 1.0149 1.0048 1.0155 1.0095 1.0069 1.0096 1.0067
dispcorr: -0.023887322 hartree
energy: -1094.901103275588
dipole: 10.68856 -12.38010 -1.69154 13.99809 -12.86946 1.12863 0.23271 -1.33259 -1.09988
magnitude: 2.31190 au
magnitude: 5.87638 debye
