program: Orca
programVersion: 5.0.2
elementType: O O O O N C C C C C C C C C C C C C C C C C C C H H H H H H H H H H H H H H H H H H H H H H H H H
charge: 0
multiplicity: 1
keywords: wb97x-d3
keywords: def2-TZVPP
keywords: def2/J RIJCOSX
keywords: DEFGRID2
keywords: scfconv7
keywords: smallprint printgap noloewdin
keywords: NOSOSCF
formula: C19H25NO4
InChI: InChI=1/C19H25NO4/c1-11(2)9-14-15(19(14,3)4)18(23)24-10-20-16(21)12-7-5-6-8-13(12)17(20)22/h9,14-15H,5-8,10H2,1-4H3
49 atoms
O  1.123105 -1.70147 -0.998451
O  1.868141 -1.553496 1.110611
O  -1.651283 -1.452276 -2.784222
O  -1.20077 -1.083998 1.725536
N  -1.164576 -1.57481 -0.534102
C  4.19628 0.166477 -0.019715
C  3.047538 1.105374 0.102119
C  2.869626 -0.239496 -0.626849
C  5.258908 0.515959 -1.036663
C  4.760614 -0.528907 1.19455
C  2.369511 1.389264 1.388465
C  1.945124 -1.22043 -0.044273
C  1.119193 1.850313 1.480261
C  -0.027697 -2.436463 -0.613509
C  0.493283 2.16538 2.803056
C  0.263029 2.084867 0.267348
C  -2.86423 -0.143139 -1.150221
C  -2.722488 -0.029638 0.170591
C  -3.862297 0.587197 -1.969036
C  -3.523336 0.865632 1.040335
C  -4.910244 1.219184 -1.050868
C  -4.275864 1.876686 0.173412
C  -1.856975 -1.110091 -1.648263
C  -1.624057 -0.927174 0.609632
H  3.047747 1.935929 -0.599762
H  2.809138 -0.166919 -1.706461
H  6.011466 1.17284 -0.595717
H  5.769611 -0.380675 -1.393749
H  4.841795 1.02896 -1.904496
H  4.02721 -0.745574 1.965626
H  5.23038 -1.472611 0.910731
H  5.534582 0.097785 1.642863
H  2.937771 1.236004 2.300634
H  0.105695 -2.949456 0.336729
H  -0.192697 -3.17733 -1.391749
H  -0.38044 1.531755 2.979606
H  1.186126 2.021381 3.632276
H  0.136796 3.198663 2.834416
H  0.577663 2.981168 -0.274892
H  0.309448 1.257521 -0.443794
H  -0.782699 2.233395 0.538879
H  -3.351717 1.352824 -2.56231
H  -4.330155 -0.087853 -2.689729
H  -4.221788 0.266414 1.633694
H  -2.876805 1.372949 1.760993
H  -5.491752 1.952998 -1.610772
H  -5.613225 0.447608 -0.723552
H  -5.04228 2.371434 0.771655
H  -3.582206 2.656836 -0.153918
elementType: O N C H
totalener: -1094.87454156 hartree
nucrepener: 2212.16398616 hartree
electener: -3307.03852773 hartree
oneelecener: -5886.85139491 hartree
twoeener: 2579.81286718 hartree
cpcmener: -0.03508954 hartree
kineticenergy: 1090.03223754 hartree
xcener: -105.970274182784 hartree
chargesum: 0.0000000
charge: -0.285890 -0.440277 -0.409284 -0.396921 -0.080156 0.134168 -0.024739 -0.101491 -0.263876 -0.297025 -0.262458 0.373553 -0.014246 0.071825 -0.215420 -0.274671 -0.049979 -0.088176 -0.069398 -0.086355 -0.135324 -0.133106 0.318837 0.277860 0.112395 0.092773 0.094734 0.096206 0.086322 0.095107 0.100106 0.098521 0.120376 0.130442 0.133745 0.081589 0.090469 0.101581 0.123735 0.085004 0.090015 0.100528 0.093908 0.110802 0.095372 0.080744 0.077792 0.082958 0.077324
qa: -0.2859 -0.4403 -0.4093 -0.3969 -0.0802 0.1342 -0.0247 -0.1015 -0.2639 -0.2970 -0.2625 0.3736 -0.0142 0.0718 -0.2154 -0.2747 -0.0500 -0.0882 -0.0694 -0.0864 -0.1353 -0.1331 0.3188 0.2779 0.1124 0.0928 0.0947 0.0962 0.0863 0.0951 0.1001 0.0985 0.1204 0.1304 0.1337 0.0816 0.0905 0.1016 0.1237 0.0850 0.0900 0.1005 0.0939 0.1108 0.0954 0.0807 0.0778 0.0830 0.0773
va: 2.0997 2.0526 2.1074 2.1060 3.0910 3.7662 3.8118 3.8263 3.8967 3.8908 3.8292 4.1331 3.6847 3.9111 3.9083 3.9609 3.6477 3.6154 3.9154 3.9183 3.9145 3.9048 4.2023 4.1876 1.0036 1.0328 1.0024 1.0024 1.0044 1.0173 1.0005 0.9983 1.0025 1.0195 1.0032 1.0053 1.0104 0.9936 0.9991 1.0014 1.0056 1.0067 1.0144 1.0066 1.0114 1.0097 1.0065 1.0101 1.0075
dispcorr: -0.028255635 hartree
energy: -1094.902797196355
dipole: 6.20768 -7.42149 -1.21381 19.36771 -17.80250 1.56521 5.23240 -6.00029 -0.76789
magnitude: 2.12435 au
magnitude: 5.39966 debye
