program: Orca
programVersion: 5.0.2
elementType: O O O O N C C C C C C C C C C C C C C C C C C C H H H H H H H H H H H H H H H H H H H H H H H H H
charge: 0
multiplicity: 1
keywords: wb97x-d3
keywords: def2-TZVPP
keywords: def2/J RIJCOSX
keywords: DEFGRID2
keywords: scfconv7
keywords: smallprint printgap noloewdin
keywords: NOSOSCF
formula: C19H25NO4
InChI: InChI=1/C19H25NO4/c1-11(2)9-14-15(19(14,3)4)18(23)24-10-20-16(21)12-7-5-6-8-13(12)17(20)22/h9,14-15H,5-8,10H2,1-4H3
49 atoms
O  1.045468 -1.623757 -1.151726
O  0.677697 0.572275 -0.957585
O  -2.153649 0.3271 -2.210592
O  -0.998149 -2.970492 0.698847
N  -1.312962 -1.465285 -1.016717
C  2.693595 0.04612 1.461985
C  3.40921 0.818153 0.405961
C  2.635473 -0.42929 0.015188
C  3.512528 -0.815429 2.390881
C  1.457822 0.616545 2.112534
C  3.017658 2.202989 0.036034
C  1.371644 -0.388177 -0.737091
C  3.150297 2.752887 -1.172069
C  -0.18826 -1.814864 -1.826419
C  2.775441 4.181533 -1.421615
C  3.638913 2.000851 -2.370788
C  -2.986791 -0.240977 -0.014571
C  -2.664074 -1.218766 0.832602
C  -4.0218 0.792883 0.227197
C  -3.299298 -1.449556 2.152893
C  -4.40949 0.787338 1.706967
C  -4.588748 -0.630709 2.248203
C  -2.135813 -0.360919 -1.224142
C  -1.573155 -2.022168 0.228316
H  4.481987 0.640957 0.370789
H  3.234644 -1.308066 -0.194833
H  3.836198 -0.239737 3.260882
H  2.932515 -1.666285 2.753727
H  4.40659 -1.205817 1.902605
H  0.78333 -0.183615 2.424679
H  1.736272 1.174872 3.008962
H  0.895928 1.292854 1.472497
H  2.636237 2.823536 0.84238
H  -0.208391 -2.874579 -2.070045
H  -0.235495 -1.241136 -2.75228
H  2.430808 4.681619 -0.51621
H  3.621535 4.748887 -1.81832
H  1.979385 4.252585 -2.168093
H  3.949367 0.982246 -2.143644
H  2.858982 1.949312 -3.136144
H  4.487049 2.51343 -2.83284
H  -3.653194 1.775683 -0.076306
H  -4.89271 0.590223 -0.404539
H  -3.499902 -2.513552 2.299962
H  -2.597698 -1.163833 2.943963
H  -3.632493 1.298442 2.282759
H  -5.327781 1.359515 1.845932
H  -5.377885 -1.136582 1.68384
H  -4.922668 -0.594986 3.28648
elementType: O N C H
totalener: -1094.87420512 hartree
nucrepener: 2182.70534578 hartree
electener: -3277.57955090 hartree
oneelecener: -5828.47939407 hartree
twoeener: 2550.89984317 hartree
cpcmener: -0.03277472 hartree
kineticenergy: 1090.04806843 hartree
xcener: -105.973125299173 hartree
chargesum: 0.0000000
charge: -0.281770 -0.451654 -0.401477 -0.411531 -0.105862 0.144144 -0.023189 -0.126825 -0.264886 -0.304626 -0.255701 0.395619 -0.028803 0.087208 -0.225915 -0.267378 -0.044151 -0.085007 -0.076174 -0.071937 -0.136096 -0.137332 0.302769 0.308412 0.115278 0.097399 0.093616 0.096277 0.086314 0.098864 0.103972 0.097070 0.120939 0.140790 0.132655 0.088091 0.094318 0.094413 0.093328 0.098781 0.103940 0.093849 0.100055 0.093722 0.100506 0.078925 0.080894 0.077957 0.080207
qa: -0.2818 -0.4517 -0.4015 -0.4115 -0.1059 0.1441 -0.0232 -0.1268 -0.2649 -0.3046 -0.2557 0.3956 -0.0288 0.0872 -0.2259 -0.2674 -0.0442 -0.0850 -0.0762 -0.0719 -0.1361 -0.1373 0.3028 0.3084 0.1153 0.0974 0.0936 0.0963 0.0863 0.0989 0.1040 0.0971 0.1209 0.1408 0.1327 0.0881 0.0943 0.0944 0.0933 0.0988 0.1039 0.0938 0.1001 0.0937 0.1005 0.0789 0.0809 0.0780 0.0802
va: 2.1098 2.0397 2.1149 2.1027 3.0680 3.7324 3.8488 3.8138 3.9008 3.9096 3.8513 4.1107 3.7089 3.8999 3.9265 3.9468 3.6302 3.6892 3.9151 3.9186 3.9145 3.9162 4.2149 4.2067 1.0033 1.0299 1.0020 1.0019 1.0049 1.0043 0.9999 1.0113 0.9994 0.9915 1.0141 1.0073 0.9969 0.9961 1.0038 0.9984 1.0003 1.0158 1.0046 1.0155 1.0056 1.0067 1.0093 1.0060 1.0095
dispcorr: -0.025466027 hartree
energy: -1094.899671147704
dipole: 9.96802 -10.34556 -0.37754 15.30141 -15.38313 -0.08173 11.38695 -10.26085 1.12610
magnitude: 1.19051 au
magnitude: 3.02603 debye
