program: Orca
programVersion: 5.0.2
elementType: O O O O N C C C C C C C C C C C C C C C C C C C H H H H H H H H H H H H H H H H H H H H H H H H H
charge: 0
multiplicity: 1
keywords: wb97x-d3
keywords: def2-TZVPP
keywords: def2/J RIJCOSX
keywords: DEFGRID2
keywords: scfconv7
keywords: smallprint printgap noloewdin
keywords: NOSOSCF
formula: C19H25NO4
InChI: InChI=1/C19H25NO4/c1-11(2)9-14-15(19(14,3)4)18(23)24-10-20-16(21)12-7-5-6-8-13(12)17(20)22/h9,14-15H,5-8,10H2,1-4H3
49 atoms
O  1.024293 -1.552643 -1.153616
O  0.711973 0.64492 -0.903114
O  -2.147707 0.511798 -2.088861
O  -1.050959 -2.970627 0.62181
N  -1.328234 -1.353851 -0.995446
C  2.75838 0.082825 1.464805
C  3.490849 0.792591 0.377975
C  2.650284 -0.425829 0.032305
C  3.552911 -0.795245 2.399515
C  1.56895 0.731263 2.127657
C  3.152199 2.181519 -0.025141
C  1.38422 -0.336558 -0.710091
C  3.240311 2.680353 -1.259066
C  -0.215808 -1.683705 -1.829715
C  2.91154 4.114154 -1.54124
C  3.634394 1.868218 -2.453225
C  -3.032032 -0.203921 0.041702
C  -2.724338 -1.232254 0.832556
C  -4.083531 0.803903 0.318667
C  -3.393863 -1.550438 2.117221
C  -4.513813 0.699462 1.782577
C  -4.695133 -0.75246 2.222978
C  -2.150822 -0.241997 -1.151531
C  -1.615486 -1.992052 0.203517
H  4.553253 0.563925 0.329017
H  3.204627 -1.336033 -0.165799
H  3.93544 -0.211673 3.239735
H  2.934543 -1.597192 2.807261
H  4.407033 -1.254598 1.900423
H  0.87441 -0.027311 2.493657
H  1.899098 1.312618 2.990691
H  1.013372 1.403307 1.478748
H  2.844702 2.848826 0.775592
H  -0.260016 -2.728575 -2.127782
H  -0.256528 -1.061669 -2.724185
H  2.616253 4.653898 -0.641318
H  3.763325 4.637169 -1.983463
H  2.093634 4.191809 -2.262571
H  4.496893 2.312513 -2.956744
H  3.887418 0.837994 -2.20964
H  2.826547 1.849979 -3.189623
H  -3.718831 1.807744 0.088149
H  -4.933736 0.632192 -0.349581
H  -3.585362 -2.623369 2.192858
H  -2.720241 -1.305861 2.945068
H  -3.758724 1.177278 2.413236
H  -5.440985 1.254582 1.931152
H  -5.458199 -1.226697 1.598844
H  -5.06413 -0.789108 3.248924
elementType: O N C H
totalener: -1094.87465263 hartree
nucrepener: 2176.30051348 hartree
electener: -3271.17516611 hartree
oneelecener: -5815.68877454 hartree
twoeener: 2544.51360843 hartree
cpcmener: -0.03297387 hartree
kineticenergy: 1090.06463113 hartree
xcener: -105.976596156343 hartree
chargesum: 0.0000000
charge: -0.284248 -0.452332 -0.402301 -0.411798 -0.102913 0.137568 -0.018865 -0.123239 -0.264488 -0.303591 -0.260172 0.396498 -0.024981 0.084899 -0.225055 -0.268593 -0.052873 -0.084910 -0.076425 -0.072424 -0.135434 -0.137452 0.308365 0.310919 0.115372 0.097066 0.093950 0.095850 0.086051 0.099256 0.103137 0.098348 0.119975 0.141960 0.132479 0.088202 0.094527 0.094079 0.105658 0.093521 0.098681 0.093803 0.100282 0.093170 0.100628 0.078716 0.080794 0.078136 0.080205
qa: -0.2842 -0.4523 -0.4023 -0.4118 -0.1029 0.1376 -0.0189 -0.1232 -0.2645 -0.3036 -0.2602 0.3965 -0.0250 0.0849 -0.2251 -0.2686 -0.0529 -0.0849 -0.0764 -0.0724 -0.1354 -0.1375 0.3084 0.3109 0.1154 0.0971 0.0940 0.0959 0.0861 0.0993 0.1031 0.0983 0.1200 0.1420 0.1325 0.0882 0.0945 0.0941 0.1057 0.0935 0.0987 0.0938 0.1003 0.0932 0.1006 0.0787 0.0808 0.0781 0.0802
va: 2.1099 2.0380 2.1142 2.1040 3.0678 3.7344 3.8455 3.8141 3.9011 3.9079 3.8557 4.1015 3.7059 3.8993 3.9263 3.9457 3.6396 3.6874 3.9170 3.9190 3.9146 3.9159 4.2129 4.2127 1.0032 1.0301 1.0017 1.0022 1.0052 1.0030 0.9994 1.0121 1.0000 0.9917 1.0146 1.0073 0.9967 0.9966 1.0000 1.0039 0.9987 1.0159 1.0046 1.0158 1.0054 1.0067 1.0093 1.0061 1.0094
dispcorr: -0.025203539 hartree
energy: -1094.899856169861
dipole: 10.11557 -10.54560 -0.43003 14.34922 -14.52127 -0.17205 10.95826 -9.87821 1.08006
magnitude: 1.17518 au
magnitude: 2.98707 debye
