program: Orca
programVersion: 5.0.2
elementType: O O O O N C C C C C C C C C C C C C C C C C C C H H H H H H H H H H H H H H H H H H H H H H H H H
charge: 0
multiplicity: 1
keywords: wb97x-d3
keywords: def2-TZVPP
keywords: def2/J RIJCOSX
keywords: DEFGRID2
keywords: scfconv7
keywords: smallprint printgap noloewdin
keywords: NOSOSCF
formula: C19H25NO4
InChI: InChI=1/C19H25NO4/c1-11(2)9-14-15(19(14,3)4)18(23)24-10-20-16(21)12-7-5-6-8-13(12)17(20)22/h9,14-15H,5-8,10H2,1-4H3
49 atoms
O  1.011826 -1.552147 -1.141919
O  0.70274 0.640975 -0.848526
O  -2.142598 0.539799 -2.063924
O  -1.083277 -2.960538 0.638012
N  -1.34233 -1.336272 -0.974287
C  2.83975 0.065406 1.436685
C  3.525436 0.781869 0.324453
C  2.672752 -0.437612 0.008023
C  3.676133 -0.815675 2.331971
C  1.678114 0.707664 2.153377
C  3.165102 2.171104 -0.059206
C  1.38158 -0.342324 -0.689595
C  3.201552 2.674989 -1.293879
C  -0.233763 -1.673455 -1.810082
C  2.847863 4.106601 -1.55869
C  3.553704 1.869061 -2.505452
C  -3.045658 -0.180392 0.056778
C  -2.748208 -1.212938 0.846062
C  -4.094425 0.831745 0.329071
C  -3.42761 -1.531009 2.125736
C  -4.53389 0.726059 1.79026
C  -4.725456 -0.726283 2.225929
C  -2.156163 -0.218037 -1.130056
C  -1.640354 -1.977431 0.220167
H  4.585493 0.556158 0.230697
H  3.219419 -1.34634 -0.216949
H  3.078601 -1.622897 2.760252
H  4.510304 -1.26802 1.793932
H  4.091631 -0.235602 3.158935
H  2.044253 1.296251 2.996775
H  1.084501 1.370645 1.528935
H  1.009158 -0.055457 2.556474
H  2.884666 2.833259 0.755702
H  -0.286913 -2.717888 -2.108445
H  -0.272585 -1.05115 -2.704525
H  1.998274 4.177542 -2.243463
H  2.586378 4.642246 -0.645818
H  3.674491 4.638785 -2.036863
H  4.382883 2.328656 -3.049904
H  3.836951 0.843809 -2.273664
H  2.711824 1.834857 -3.202442
H  -3.723878 1.83438 0.102435
H  -4.94144 0.664848 -0.34451
H  -3.625823 -2.603099 2.197131
H  -2.757917 -1.292619 2.958565
H  -3.779831 1.198288 2.426522
H  -5.459043 1.285774 1.934945
H  -5.487252 -1.194341 1.595762
H  -5.100804 -0.7638 3.24949
elementType: O N C H
totalener: -1094.87460817 hartree
nucrepener: 2173.88989166 hartree
electener: -3268.76449983 hartree
oneelecener: -5810.89975297 hartree
twoeener: 2542.13525314 hartree
cpcmener: -0.03284211 hartree
kineticenergy: 1090.05420366 hartree
xcener: -105.974634414426 hartree
chargesum: 0.0000000
charge: -0.284844 -0.454244 -0.402514 -0.412088 -0.101976 0.137977 -0.016959 -0.128900 -0.265336 -0.302772 -0.260349 0.403436 -0.024982 0.085145 -0.224924 -0.268852 -0.055537 -0.081562 -0.076777 -0.073012 -0.135435 -0.137546 0.309421 0.309614 0.115234 0.096640 0.095918 0.086252 0.093953 0.102937 0.097702 0.099200 0.120005 0.141814 0.132575 0.094269 0.088139 0.094381 0.105638 0.093767 0.098665 0.093788 0.100274 0.093089 0.100837 0.078666 0.080820 0.078168 0.080284
qa: -0.2848 -0.4542 -0.4025 -0.4121 -0.1020 0.1380 -0.0170 -0.1289 -0.2653 -0.3028 -0.2603 0.4034 -0.0250 0.0851 -0.2249 -0.2689 -0.0555 -0.0816 -0.0768 -0.0730 -0.1354 -0.1375 0.3094 0.3096 0.1152 0.0966 0.0959 0.0863 0.0940 0.1029 0.0977 0.0992 0.1200 0.1418 0.1326 0.0943 0.0881 0.0944 0.1056 0.0938 0.0987 0.0938 0.1003 0.0931 0.1008 0.0787 0.0808 0.0782 0.0803
va: 2.1098 2.0364 2.1140 2.1039 3.0683 3.7338 3.8419 3.8187 3.9010 3.9074 3.8563 4.0939 3.7060 3.8989 3.9263 3.9457 3.6434 3.6871 3.9172 3.9187 3.9146 3.9157 4.2119 4.2149 1.0032 1.0302 1.0022 1.0051 1.0018 0.9992 1.0125 1.0030 0.9998 0.9915 1.0142 0.9965 1.0073 0.9969 1.0002 1.0038 0.9988 1.0159 1.0045 1.0157 1.0052 1.0067 1.0093 1.0061 1.0094
dispcorr: -0.025085293 hartree
energy: -1094.899693464517
dipole: 10.26455 -10.69238 -0.42783 14.25345 -14.42482 -0.17137 10.59577 -9.57215 1.02363
magnitude: 1.12260 au
magnitude: 2.85341 debye
