program: Orca
programVersion: 5.0.2
elementType: Br Br Br Br O O O N C C C C C C C C C C C C C C C C C C C C C C H H H H H H H H H H H H H H H H H H H
charge: 0
multiplicity: 1
keywords: wb97x-d3
keywords: def2-TZVPP
keywords: def2/J RIJCOSX
keywords: DEFGRID2
keywords: scfconv7
keywords: smallprint printgap noloewdin
keywords: NOSOSCF
formula: C22H19Br4NO3
InChI: InChI=1/C22H19Br4NO3/c1-21(2)17(19(23)22(24,25)26)18(21)20(28)30-16(12-27)13-7-6-10-15(11-13)29-14-8-4-3-5-9-14/h3-11,16-19H,1-2H3
49 atoms
Br 3.745603 -1.302956 -0.786376
Br 1.184884 0.991722 -0.914429
Br 0.063717 -0.131682 1.784911
Br 2.989264 0.985149 1.668952
O  -1.621636 -2.791253 -0.818248
O  -1.957071 -3.374287 1.315892
O  -1.948729 2.301764 -1.599804
N  -3.611561 -2.688957 -3.451663
C  1.276335 -3.778605 -0.438737
C  1.142705 -2.295435 -0.308509
C  0.266836 -3.197826 0.531093
C  2.159649 -1.416312 0.356691
C  2.434615 -4.502397 0.209712
C  0.853507 -4.414319 -1.741784
C  -1.20578 -3.154103 0.408056
C  1.65202 0.001328 0.674804
C  -2.977959 -2.372346 -0.937264
C  -3.103232 -0.936103 -0.493606
C  -3.324047 -2.551049 -2.348317
C  -2.527466 0.0682 -1.25836
C  -3.715255 -0.634804 0.714686
C  -2.564253 1.381291 -0.814499
C  -3.745925 0.681591 1.148478
C  -3.171959 1.6939 0.397043
C  -2.326232 3.615693 -1.525912
C  -3.628997 3.999238 -1.815663
C  -1.363185 4.558512 -1.205807
C  -3.963273 5.343304 -1.780234
C  -1.708791 5.902156 -1.182793
C  -3.00714 6.298567 -1.463901
H  0.644441 -1.826426 -1.150206
H  0.550201 -3.308532 1.571846
H  2.50023 -1.851703 1.299508
H  2.738748 -4.065376 1.160807
H  2.16011 -5.539674 0.406257
H  3.304698 -4.504531 -0.446698
H  0.509317 -5.436504 -1.577313
H  0.061658 -3.872494 -2.251646
H  1.709389 -4.457929 -2.416618
H  -3.636213 -3.012836 -0.34292
H  -2.050215 -0.153076 -2.205723
H  -4.149668 -1.420266 1.317973
H  -4.216701 0.925522 2.091334
H  -3.195671 2.714274 0.755782
H  -4.371403 3.254574 -2.073721
H  -0.353607 4.238963 -0.982262
H  -4.976735 5.645121 -2.009086
H  -0.957184 6.64062 -0.937535
H  -3.273008 7.346675 -1.442132
nucrepener: 5986.59581324 hartree
xcener: -389.816671877462 hartree
chargesum: -0.0000000
charge: -0.060378 -0.012207 -0.009879 0.002439 -0.267810 -0.341673 -0.295322 0.001204 0.089457 -0.097705 -0.106651 -0.181465 -0.249867 -0.242447 0.306078 0.076118 0.321407 0.065996 -0.279203 -0.260307 -0.137118 0.217127 -0.126626 -0.142183 0.202966 -0.139375 -0.170767 -0.124434 -0.113746 -0.125795 0.112854 0.102804 0.148715 0.075107 0.104473 0.100453 0.094283 0.095469 0.094088 0.124462 0.120800 0.118807 0.131329 0.134204 0.135160 0.124663 0.128401 0.128285 0.127811
qa: -0.0604 -0.0122 -0.0099 0.0024 -0.2678 -0.3417 -0.2953 0.0012 0.0895 -0.0977 -0.1067 -0.1815 -0.2499 -0.2424 0.3061 0.0761 0.3214 0.0660 -0.2792 -0.2603 -0.1371 0.2171 -0.1266 -0.1422 0.2030 -0.1394 -0.1708 -0.1244 -0.1137 -0.1258 0.1129 0.1028 0.1487 0.0751 0.1045 0.1005 0.0943 0.0955 0.0941 0.1245 0.1208 0.1188 0.1313 0.1342 0.1352 0.1247 0.1284 0.1283 0.1278
va: 1.2027 1.2299 1.2360 1.2388 2.0953 2.1589 2.0778 3.1122 3.8677 3.6887 3.8707 4.1211 3.9139 3.9075 4.2649 4.2853 3.8334 3.5931 4.0275 4.0537 3.9768 3.8184 3.9646 3.9251 3.8398 3.9724 4.0110 3.9550 3.9602 3.9438 1.0427 1.0249 1.0016 1.0079 1.0046 1.0080 1.0024 1.0159 1.0037 1.0165 1.0315 1.0205 1.0007 1.0063 1.0036 1.0114 0.9997 1.0001 0.9997
dispcorr: -0.035105362 hartree
energy: -11427.146457561148
dipole: -87.54855 87.79341 0.24486 -13.64085 14.12386 0.48302 -27.57716 28.60884 1.03168
magnitude: 1.16517 au
magnitude: 2.96163 debye
