program: Orca
programVersion: 5.0.2
elementType: Br Br Br Br O O O N C C C C C C C C C C C C C C C C C C C C C C H H H H H H H H H H H H H H H H H H H
charge: 0
multiplicity: 1
keywords: wb97x-d3
keywords: def2-TZVPP
keywords: def2/J RIJCOSX
keywords: DEFGRID2
keywords: scfconv7
keywords: smallprint printgap noloewdin
keywords: NOSOSCF
formula: C22H19Br4NO3
InChI: InChI=1/C22H19Br4NO3/c1-21(2)17(19(23)22(24,25)26)18(21)20(28)30-16(12-27)13-7-6-10-15(11-13)29-14-8-4-3-5-9-14/h3-11,16-19H,1-2H3
49 atoms
Br 3.765426 0.180032 1.207637
Br 2.186016 -2.9000 1.532085
Br 0.929919 -2.493857 -1.315222
Br 4.033341 -2.441957 -0.978012
O  -2.280743 -0.073453 -0.961506
O  -1.848099 -0.430029 1.202929
O  -5.317011 4.022217 -0.20059
N  -4.561298 -1.081567 -3.126449
C  0.578457 1.50469 0.601284
C  1.009718 0.075651 0.656927
C  -0.147695 0.46107 -0.227992
C  2.294699 -0.416752 0.06105
C  1.372108 2.518431 -0.189631
C  -0.052999 2.0880 1.841192
C  -1.485896 -0.056311 0.122946
C  2.368152 -1.940974 -0.129968
C  -3.604698 -0.542938 -0.754996
C  -4.475733 0.469084 -0.049049
C  -4.126277 -0.839093 -2.091654
C  -4.462566 1.792095 -0.466921
C  -5.294603 0.067436 0.994457
C  -5.269503 2.716756 0.180568
C  -6.116896 0.995482 1.614105
C  -6.103616 2.321684 1.217666
C  -4.160401 4.681362 -0.504549
C  -4.199582 5.579859 -1.560448
C  -2.997471 4.515402 0.238282
C  -3.068473 6.318018 -1.872339
C  -1.87245 5.256164 -0.089617
C  -1.899429 6.157357 -1.143871
H  0.720659 -0.432912 1.571312
H  0.039053 0.525846 -1.293685
H  2.478232 0.034205 -0.917422
H  1.811087 2.10957 -1.099675
H  0.724032 3.342379 -0.492758
H  2.182516 2.929291 0.412732
H  0.724518 2.504122 2.48336
H  -0.736858 2.896862 1.578684
H  -0.608352 1.356066 2.422025
H  -3.595867 -1.47716 -0.183171
H  -3.831117 2.103923 -1.29026
H  -5.28649 -0.96191 1.32825
H  -6.759254 0.687851 2.427919
H  -6.731909 3.055046 1.705383
H  -5.114401 5.698289 -2.125938
H  -2.971639 3.824042 1.071384
H  -3.103063 7.019189 -2.695505
H  -0.970031 5.136319 0.496439
H  -1.018967 6.734493 -1.391027
nucrepener: 5618.14298453 hartree
xcener: -389.815186251493 hartree
chargesum: 0.0000000
charge: -0.059035 0.002768 -0.005846 0.009599 -0.265523 -0.359487 -0.298752 0.002650 0.099767 -0.086639 -0.153350 -0.178082 -0.247493 -0.244105 0.338393 0.034346 0.314160 0.057287 -0.254174 -0.178407 -0.141881 0.189385 -0.093583 -0.191053 0.229474 -0.208100 -0.144645 -0.083711 -0.130100 -0.155159 0.122842 0.104307 0.151080 0.075858 0.096895 0.102702 0.102280 0.057704 0.107337 0.124696 0.134614 0.107188 0.128619 0.131154 0.128629 0.136517 0.127773 0.134422 0.126680
qa: -0.0590 0.0028 -0.0058 0.0096 -0.2655 -0.3595 -0.2988 0.0027 0.0998 -0.0866 -0.1534 -0.1781 -0.2475 -0.2441 0.3384 0.0343 0.3142 0.0573 -0.2542 -0.1784 -0.1419 0.1894 -0.0936 -0.1911 0.2295 -0.2081 -0.1446 -0.0837 -0.1301 -0.1552 0.1228 0.1043 0.1511 0.0759 0.0969 0.1027 0.1023 0.0577 0.1073 0.1247 0.1346 0.1072 0.1286 0.1312 0.1286 0.1365 0.1278 0.1344 0.1267
va: 1.2041 1.2368 1.2375 1.2418 2.1161 2.1470 2.1130 3.1200 3.8411 3.7175 3.9261 4.1169 3.9058 3.9006 4.2029 4.3504 3.8424 3.6383 4.0211 3.9512 4.0282 3.8681 3.9566 4.0401 3.8584 4.0419 3.9096 3.9391 3.9282 3.9960 1.0455 1.0279 1.0018 1.0114 1.0130 1.0062 1.0054 1.0172 1.0229 1.0183 1.0196 1.0136 0.9998 1.0100 1.0130 1.0002 0.9979 0.9926 1.0019
dispcorr: -0.031667579 hartree
energy: -11427.144832396838
dipole: -131.46967 131.85552 0.38585 115.36432 -114.17403 1.19029 -1.04142 1.84922 0.80780
magnitude: 1.48937 au
magnitude: 3.78568 debye
