program: Orca
programVersion: 5.0.2
elementType: Br Br Br Br O O O N C C C C C C C C C C C C C C C C C C C C C C H H H H H H H H H H H H H H H H H H H
charge: 0
multiplicity: 1
keywords: wb97x-d3
keywords: def2-TZVPP
keywords: def2/J RIJCOSX
keywords: DEFGRID2
keywords: scfconv7
keywords: smallprint printgap noloewdin
keywords: NOSOSCF
formula: C22H19Br4NO3
InChI: InChI=1/C22H19Br4NO3/c1-21(2)17(19(23)22(24,25)26)18(21)20(28)30-16(12-27)13-7-6-10-15(11-13)29-14-8-4-3-5-9-14/h3-11,16-19H,1-2H3
49 atoms
Br 3.680514 -0.694081 -1.341611
Br 2.931259 0.403995 1.867023
Br 0.928225 -2.001134 2.161113
Br 3.934286 -2.555774 1.517632
O  -2.526412 -0.966333 0.299021
O  -1.492867 1.009182 0.091762
O  -5.494381 3.228754 -1.956322
N  -4.721505 -2.085914 2.491505
C  0.251553 -0.549574 -1.993624
C  0.96456 -0.431492 -0.686412
C  -0.439987 -0.980935 -0.712208
C  2.126227 -1.306299 -0.318182
C  0.587841 -1.667527 -2.953308
C  -0.134133 0.727953 -2.699665
C  -1.507935 -0.179305 -0.079002
C  2.470033 -1.33766 1.180605
C  -3.654754 -0.319994 0.889027
C  -4.6165 0.153372 -0.172762
C  -4.251329 -1.316878 1.780001
C  -4.605998 1.492824 -0.53715
C  -5.455647 -0.746191 -0.818552
C  -5.430535 1.928997 -1.567441
C  -6.287614 -0.294464 -1.829396
C  -6.273411 1.035958 -2.21461
C  -4.379395 4.019873 -1.94227
C  -3.133277 3.559915 -2.349866
C  -4.551503 5.341461 -1.55773
C  -2.058421 4.434782 -2.359092
C  -3.469852 6.207764 -1.584478
C  -2.218435 5.759056 -1.979075
H  1.038656 0.585589 -0.314265
H  -0.559672 -2.052386 -0.601689
H  1.95618 -2.341584 -0.623946
H  -0.264805 -1.864884 -3.604421
H  1.433879 -1.394746 -3.584225
H  0.83298 -2.606764 -2.45745
H  -0.340501 1.545635 -2.013339
H  0.681684 1.037375 -3.354437
H  -1.018214 0.573455 -3.321384
H  -3.330959 0.5251 1.504165
H  -3.948742 2.186912 -0.029538
H  -5.47202 -1.789135 -0.529116
H  -6.950349 -0.98684 -2.330679
H  -6.915903 1.391322 -3.009355
H  -2.995706 2.530669 -2.654905
H  -5.529995 5.683631 -1.247451
H  -1.087435 4.073817 -2.671977
H  -3.608047 7.238915 -1.287665
H  -1.374601 6.435251 -1.990999
nucrepener: 5598.75557186 hartree
xcener: -389.811611040584 hartree
chargesum: 0.0000000
charge: -0.059638 0.001419 -0.003527 0.009473 -0.251079 -0.383222 -0.296775 -0.000851 0.091764 -0.076012 -0.183414 -0.177820 -0.244114 -0.264641 0.392037 0.034398 0.308936 0.001181 -0.257209 -0.160188 -0.173739 0.236865 -0.094951 -0.201087 0.256676 -0.168190 -0.215956 -0.092710 -0.086458 -0.152823 0.125609 0.103854 0.150768 0.103644 0.100640 0.076889 0.086451 0.100580 0.095156 0.123926 0.135497 0.122455 0.130592 0.129677 0.127178 0.125190 0.121671 0.126211 0.125665
qa: -0.0596 0.0014 -0.0035 0.0095 -0.2511 -0.3832 -0.2968 -0.0009 0.0918 -0.0760 -0.1834 -0.1778 -0.2441 -0.2646 0.3920 0.0344 0.3089 0.0012 -0.2572 -0.1602 -0.1737 0.2369 -0.0950 -0.2011 0.2567 -0.1682 -0.2160 -0.0927 -0.0865 -0.1528 0.1256 0.1039 0.1508 0.1036 0.1006 0.0769 0.0865 0.1006 0.0952 0.1239 0.1355 0.1225 0.1306 0.1297 0.1272 0.1252 0.1217 0.1262 0.1257
va: 1.2049 1.2344 1.2380 1.2420 2.1298 2.1137 2.1223 3.1169 3.8558 3.6972 3.9676 4.1121 3.9052 3.9098 4.1594 4.3475 3.8391 3.6752 4.0210 3.9139 4.0437 3.8633 3.9452 4.0476 3.8284 3.9490 4.0425 3.9442 3.9361 3.9954 1.0402 1.0274 1.0030 1.0046 1.0084 1.0092 1.0193 1.0068 0.9982 1.0181 1.0190 1.0160 0.9995 1.0118 0.9989 1.0143 1.0010 0.9984 1.0010
dispcorr: -0.030916871 hartree
energy: -11427.145325653986
dipole: -142.21260 142.43294 0.22034 63.46954 -63.04827 0.42127 -70.56460 69.00208 -1.56252
magnitude: 1.63325 au
magnitude: 4.15138 debye
