program: Orca
programVersion: 5.0.2
elementType: Br Br Br Br O O O N C C C C C C C C C C C C C C C C C C C C C C H H H H H H H H H H H H H H H H H H H
charge: 0
multiplicity: 1
keywords: wb97x-d3
keywords: def2-TZVPP
keywords: def2/J RIJCOSX
keywords: DEFGRID2
keywords: scfconv7
keywords: smallprint printgap noloewdin
keywords: NOSOSCF
formula: C22H19Br4NO3
InChI: InChI=1/C22H19Br4NO3/c1-21(2)17(19(23)22(24,25)26)18(21)20(28)30-16(12-27)13-7-6-10-15(11-13)29-14-8-4-3-5-9-14/h3-11,16-19H,1-2H3
49 atoms
Br 3.456156 -1.618036 -1.469078
Br 3.161273 1.008106 0.763526
Br 1.41663 -0.832768 2.62505
Br 4.314734 -1.705254 1.854076
O  -2.569384 -1.165093 0.826641
O  -1.534347 0.618249 -0.044906
O  -5.49126 2.771646 -2.290494
N  -5.23736 -1.763564 2.671133
C  -0.016128 -1.791429 -1.492213
C  0.86383 -1.021035 -0.556983
C  -0.464277 -1.5247 -0.066071
C  2.14549 -1.581924 -0.014131
C  0.276616 -3.235826 -1.824531
C  -0.637631 -1.038767 -2.643926
C  -1.537908 -0.550639 0.223721
C  2.726977 -0.821186 1.190006
C  -3.733375 -0.375716 1.047109
C  -4.464431 -0.082608 -0.24123
C  -4.56545 -1.162378 1.959977
C  -4.63512 1.233431 -0.638369
C  -4.927946 -1.127487 -1.030397
C  -5.264317 1.509489 -1.846202
C  -5.56719 -0.839804 -2.224796
C  -5.731032 0.471478 -2.64117
C  -4.628903 3.79244 -2.002088
C  -3.248455 3.63385 -2.013061
C  -5.194617 5.034488 -1.753896
C  -2.440375 4.732611 -1.763571
C  -4.373355 6.125902 -1.519253
C  -2.994154 5.980379 -1.517903
H  0.89531 0.045269 -0.757285
H  -0.47034 -2.39944 0.574864
H  2.020181 -2.621396 0.299769
H  -0.646009 -3.741635 -2.112811
H  0.971984 -3.308845 -2.660688
H  0.699671 -3.796022 -0.990661
H  0.02644 -1.081205 -3.508198
H  -1.589627 -1.488485 -2.931286
H  -0.81808 0.009697 -2.418144
H  -3.472625 0.562342 1.548311
H  -4.261649 2.037188 -0.017022
H  -4.800839 -2.154989 -0.714144
H  -5.938637 -1.644669 -2.844527
H  -6.222982 0.69892 -3.577561
H  -2.801044 2.667125 -2.205136
H  -6.271585 5.138993 -1.752745
H  -1.365964 4.606344 -1.766091
H  -4.817826 7.093806 -1.329214
H  -2.355524 6.832076 -1.327637
nucrepener: 5570.05857182 hartree
twoeener: 9973.28198748 hartree
xcener: -389.811790964945 hartree
chargesum: -0.0000000
charge: -0.060653 0.000894 -0.006631 0.009641 -0.249836 -0.364796 -0.295178 0.000941 0.070686 -0.068638 -0.159715 -0.179329 -0.249429 -0.231569 0.348671 0.033658 0.313684 0.038753 -0.255576 -0.160605 -0.220038 0.253301 -0.083956 -0.202908 0.263946 -0.175990 -0.219332 -0.113275 -0.087633 -0.144727 0.121060 0.103249 0.149886 0.103767 0.101470 0.076714 0.099029 0.092007 0.083937 0.118099 0.120954 0.123809 0.129974 0.129781 0.135340 0.125790 0.128150 0.126454 0.126169
qa: -0.0607 0.0009 -0.0066 0.0096 -0.2498 -0.3648 -0.2952 0.0009 0.0707 -0.0686 -0.1597 -0.1793 -0.2494 -0.2316 0.3487 0.0337 0.3137 0.0388 -0.2556 -0.1606 -0.2200 0.2533 -0.0840 -0.2029 0.2639 -0.1760 -0.2193 -0.1133 -0.0876 -0.1447 0.1211 0.1032 0.1499 0.1038 0.1015 0.0767 0.0990 0.0920 0.0839 0.1181 0.1210 0.1238 0.1300 0.1298 0.1353 0.1258 0.1281 0.1265 0.1262
va: 1.2028 1.2346 1.2340 1.2411 2.1368 2.1408 2.1239 3.1184 3.9009 3.7009 3.8999 4.1132 3.9005 3.9032 4.2294 4.3594 3.8449 3.6038 4.0199 3.9420 4.0316 3.8645 3.9271 4.0414 3.7857 3.9491 4.0424 3.9545 3.9303 3.9632 1.0433 1.0276 1.0027 1.0046 1.0081 1.0081 1.0056 1.0035 1.0216 1.0180 1.0158 1.0179 0.9988 1.0119 0.9988 1.0145 0.9998 0.9987 1.0002
dispcorr: -0.030307955 hartree
energy: -11427.143733084782
dipole: -153.01736 153.38395 0.36659 35.53356 -35.48788 0.04567 -60.92228 59.70729 -1.21499
magnitude: 1.26991 au
magnitude: 3.22786 debye
