program: Orca
programVersion: 5.0.2
elementType: Br Br Br Br O O O N C C C C C C C C C C C C C C C C C C C C C C H H H H H H H H H H H H H H H H H H H
charge: 0
multiplicity: 1
keywords: wb97x-d3
keywords: def2-TZVPP
keywords: def2/J RIJCOSX
keywords: DEFGRID2
keywords: scfconv7
keywords: smallprint printgap noloewdin
keywords: NOSOSCF
formula: C22H19Br4NO3
InChI: InChI=1/C22H19Br4NO3/c1-21(2)17(19(23)22(24,25)26)18(21)20(28)30-16(12-27)13-7-6-10-15(11-13)29-14-8-4-3-5-9-14/h3-11,16-19H,1-2H3
49 atoms
Br 3.566987 -1.115601 2.134787
Br 2.124354 -3.742839 0.42695
Br 1.442021 -1.78584 -1.936066
Br 4.412241 -2.139338 -1.023238
O  -1.846598 0.650921 -0.9019
O  -1.894349 -1.027959 0.578245
O  -4.832661 4.419762 1.23705
N  -3.684793 1.46546 -3.531206
C  0.566401 0.603789 1.724713
C  1.002119 -0.659303 1.053109
C  0.088891 0.285645 0.318222
C  2.408066 -0.873295 0.573726
C  1.504808 1.782753 1.839297
C  -0.366703 0.479599 2.90445
C  -1.301188 -0.132092 0.045498
C  2.586595 -2.057999 -0.388611
C  -3.228444 0.443718 -1.169909
C  -4.099872 1.098384 -0.125386
C  -3.466343 1.021773 -2.494695
C  -4.04975 2.478659 0.033302
C  -4.914961 0.322944 0.68306
C  -4.844706 3.08358 0.995945
C  -5.697858 0.938498 1.649211
C  -5.672166 2.312083 1.805499
C  -4.579269 5.313559 0.233233
C  -5.157535 5.199281 -1.024779
C  -3.761693 6.390894 0.53943
C  -4.899027 6.1706 -1.979308
C  -3.522929 7.361958 -0.421051
C  -4.0841 7.253988 -1.684465
H  0.516911 -1.553235 1.432534
H  0.52844 0.904067 -0.456204
H  2.785793 0.012347 0.056733
H  2.132184 1.693922 2.726034
H  2.162505 1.897584 0.977711
H  0.929334 2.705137 1.927373
H  -0.983485 1.374223 3.004525
H  -1.030137 -0.378954 2.836343
H  0.219374 0.374973 3.818551
H  -3.454993 -0.625841 -1.223527
H  -3.40172 3.076363 -0.596809
H  -4.931171 -0.752509 0.569097
H  -6.337942 0.341435 2.284496
H  -6.286425 2.798257 2.551863
H  -5.803396 4.36389 -1.262875
H  -3.326443 6.466795 1.527153
H  -5.344967 6.077778 -2.960467
H  -2.887824 8.203746 -0.178838
H  -3.890135 8.009071 -2.43391
nucrepener: 5497.38151134 hartree
twoeener: 9900.96253208 hartree
xcener: -389.812184026798 hartree
chargesum: 0.0000000
charge: -0.060606 0.001150 -0.005770 0.007546 -0.261043 -0.366076 -0.296314 -0.001743 0.072778 -0.067737 -0.165770 -0.181094 -0.245603 -0.244229 0.359112 0.036789 0.335571 0.019851 -0.265414 -0.215473 -0.136180 0.238575 -0.085447 -0.209057 0.266846 -0.184696 -0.223205 -0.099688 -0.085085 -0.147949 0.121147 0.102934 0.148577 0.100626 0.076173 0.103474 0.092406 0.099474 0.096093 0.122084 0.130893 0.114251 0.128219 0.130000 0.135411 0.124364 0.131220 0.125898 0.126719
qa: -0.0606 0.0011 -0.0058 0.0075 -0.2610 -0.3661 -0.2963 -0.0017 0.0728 -0.0677 -0.1658 -0.1811 -0.2456 -0.2442 0.3591 0.0368 0.3356 0.0199 -0.2654 -0.2155 -0.1362 0.2386 -0.0854 -0.2091 0.2668 -0.1847 -0.2232 -0.0997 -0.0851 -0.1479 0.1211 0.1029 0.1486 0.1006 0.0762 0.1035 0.0924 0.0995 0.0961 0.1221 0.1309 0.1143 0.1282 0.1300 0.1354 0.1244 0.1312 0.1259 0.1267
va: 1.2029 1.2356 1.2364 1.2399 2.1295 2.1417 2.1188 3.1186 3.8855 3.6991 3.9210 4.1221 3.9019 3.9057 4.2064 4.3568 3.8316 3.6423 4.0274 3.9768 3.9969 3.8400 3.9510 4.0391 3.7752 3.9576 4.0492 3.9459 3.9277 3.9677 1.0452 1.0283 1.0031 1.0084 1.0078 1.0053 1.0021 1.0211 1.0036 1.0177 1.0181 1.0185 0.9997 1.0117 1.0032 1.0144 0.9993 0.9988 1.0004
dispcorr: -0.029383019 hartree
energy: -11427.144007683683
dipole: -142.55183 142.48751 -0.06432 124.26917 -123.57233 0.69684 17.65742 -16.59793 1.05949
magnitude: 1.26974 au
magnitude: 3.22742 debye
