program: Orca
programVersion: 5.0.2
elementType: Br Br Br Br O O O N C C C C C C C C C C C C C C C C C C C C C C H H H H H H H H H H H H H H H H H H H
charge: 0
multiplicity: 1
keywords: wb97x-d3
keywords: def2-TZVPP
keywords: def2/J RIJCOSX
keywords: DEFGRID2
keywords: scfconv7
keywords: smallprint printgap noloewdin
keywords: NOSOSCF
formula: C22H19Br4NO3
InChI: InChI=1/C22H19Br4NO3/c1-21(2)17(19(23)22(24,25)26)18(21)20(28)30-16(12-27)13-7-6-10-15(11-13)29-14-8-4-3-5-9-14/h3-11,16-19H,1-2H3
49 atoms
Br 3.658924 -0.471041 -0.510503
Br 0.843996 1.472913 -0.104816
Br -0.22378 -0.55316 2.035627
Br 2.545075 0.842598 2.467288
O  -1.523426 -2.323797 -1.311891
O  -1.823331 -3.710953 0.418257
O  -2.635678 2.718134 -0.15034
N  -3.511237 -1.489015 -3.830887
C  1.46759 -3.1535 -1.143916
C  1.169568 -1.813118 -0.553183
C  0.37683 -3.016714 -0.100278
C  2.05619 -1.099101 0.422777
C  2.682979 -3.936108 -0.701769
C  1.139253 -3.364538 -2.602346
C  -1.087793 -3.083145 -0.289873
C  1.371405 0.085148 1.129304
C  -2.919241 -2.048702 -1.349092
C  -3.246896 -0.888216 -0.441405
C  -3.2349 -1.741734 -2.745208
C  -2.773227 0.378882 -0.763798
C  -3.964159 -1.101501 0.724124
C  -3.058132 1.448403 0.071798
C  -4.223656 -0.026835 1.564481
C  -3.784275 1.242912 1.241176
C  -2.302372 3.162861 -1.39812
C  -3.064873 2.877696 -2.52409
C  -1.188481 3.985816 -1.492913
C  -2.682648 3.39669 -3.751426
C  -0.824082 4.505803 -2.725694
C  -1.561749 4.206401 -3.860965
H  0.64712 -1.148093 -1.231962
H  0.645615 -3.434206 0.863695
H  2.411097 -1.776344 1.203873
H  3.559692 -3.644405 -1.279904
H  2.923201 -3.801194 0.35284
H  2.516367 -5.002396 -0.860387
H  0.91463 -4.414242 -2.79743
H  0.29523 -2.771288 -2.944803
H  2.001572 -3.091528 -3.212027
H  -3.496575 -2.930851 -1.057296
H  -2.193046 0.525816 -1.66631
H  -4.310229 -2.094008 0.979414
H  -4.783044 -0.179614 2.47752
H  -3.993042 2.084048 1.888857
H  -3.948301 2.256639 -2.452481
H  -0.627896 4.230826 -0.599898
H  -3.273377 3.165187 -4.627574
H  0.044737 5.14677 -2.795381
H  -1.270613 4.606106 -4.822654
nucrepener: 6077.77498984 hartree
xcener: -389.818326093239 hartree
chargesum: 0.0000000
charge: -0.060549 -0.014147 -0.008704 0.002797 -0.272045 -0.340062 -0.285173 -0.002270 0.088333 -0.094321 -0.116195 -0.178331 -0.250082 -0.243950 0.311248 0.079361 0.321955 0.045924 -0.275555 -0.280447 -0.149489 0.296083 -0.087431 -0.215913 0.310528 -0.217008 -0.295368 -0.091884 -0.062497 -0.155289 0.113206 0.103066 0.148263 0.101085 0.075702 0.103870 0.094268 0.094956 0.094071 0.126159 0.133408 0.117674 0.129192 0.127104 0.138993 0.150599 0.132946 0.129108 0.126811
qa: -0.0605 -0.0141 -0.0087 0.0028 -0.2720 -0.3401 -0.2852 -0.0023 0.0883 -0.0943 -0.1162 -0.1783 -0.2501 -0.2439 0.3112 0.0794 0.3220 0.0459 -0.2756 -0.2804 -0.1495 0.2961 -0.0874 -0.2159 0.3105 -0.2170 -0.2954 -0.0919 -0.0625 -0.1553 0.1132 0.1031 0.1483 0.1011 0.0757 0.1039 0.0943 0.0950 0.0941 0.1262 0.1334 0.1177 0.1292 0.1271 0.1390 0.1506 0.1329 0.1291 0.1268
va: 1.2027 1.2382 1.2378 1.2387 2.0968 2.1614 2.1197 3.1106 3.8711 3.6875 3.8714 4.1213 3.9138 3.9080 4.2669 4.2955 3.8395 3.6181 4.0226 3.9612 3.9925 3.7622 3.9312 4.0520 3.7117 3.9729 4.0057 3.9310 3.9230 3.9886 1.0423 1.0255 1.0013 1.0075 1.0078 1.0051 1.0022 1.0157 1.0041 1.0192 1.0126 1.0191 0.9995 1.0136 1.0033 1.0086 0.9985 0.9986 1.0004
dispcorr: -0.036131372 hartree
energy: -11427.147667541725
dipole: -73.73762 74.21731 0.47968 -23.06587 22.85224 -0.21363 -58.42604 58.89432 0.46828
magnitude: 0.70357 au
magnitude: 1.78834 debye
